BDBM50447067 CHEMBL1372362::US9328112, A13
SMILES Clc1ccc(cc1)S(=O)(=O)n1c(Cc2ccccc2)nc2ccccc12
InChI Key InChIKey=WRQLCQPXWGGGJE-UHFFFAOYSA-N
Data  2 IC50
  Tab Delimited (TSV)   2D SDfile   Computed 3D by Vconf -m prep SDfile
Find this compound or compounds like it in BindingDB:
Activity Spreadsheet -- Enzyme Inhibition Constant Data from BindingDB
Found 2 hits for monomerid = 50447067
TargetAldehyde dehydrogenase, dimeric NADP-preferring(Homo sapiens (Human))
Indiana University School Of Medicine
Curated by ChEMBL
LigandPNGBDBM50447067(CHEMBL1372362 | US9328112, A13)
Affinity DataIC50: >1.00E+5nM. Assay description: Inhibition of human ALDH3A1-mediated benzaldehyde oxidation preincubated for 1 min followed by substrate addition by spectrophotometric analysis
In DepthDetails ArticlePubMed
TargetAldehyde dehydrogenase, dimeric NADP-preferring(Homo sapiens (Human))
Indiana University School Of Medicine
Curated by ChEMBL
LigandPNGBDBM50447067(CHEMBL1372362 | US9328112, A13)
Affinity DataIC50: >1.00E+5nMpH: 7.5Assay Description:IC50 values were determined for CB29 and its analogs using propionaldehyde as the substrate for ALDH1A1 and ALDH2 or benzaldehyde as the substrate fo...
In DepthDetails US Patent