BDBM50448121 CHEMBL3122110
SMILES CCNC(=O)C(C)(C)n1cc(Nc2ncc(c(NC)n2)C(F)(F)F)c(C)n1
InChI Key InChIKey=RZHUFHGNDAWQOJ-UHFFFAOYSA-N
Data  1 IC50
  Tab Delimited (TSV)   2D SDfile   Computed 3D by Vconf -m prep SDfile
Find this compound or compounds like it in BindingDB:
Activity Spreadsheet -- Enzyme Inhibition Constant Data from BindingDB
Found 1 hit for monomerid = 50448121
TargetLeucine-rich repeat serine/threonine-protein kinase 2(Homo sapiens (Human))
Genentech
Curated by ChEMBL
LigandPNGBDBM50448121(CHEMBL3122110)
Affinity DataIC50:  99nM. Assay description: Inhibition of LRRK2 (unknown origin) phosphorylation by cell-based assay
In DepthDetails ArticlePubMed