BDBM50448602 CHEMBL3127473
SMILES C[C@@]1(C[C@H](Nc2ccc(cc12)C(N)=N)c1cccc(c1)-c1ccc(cc1C(O)=O)C(N)=O)c1ccccc1
InChI Key InChIKey=DPAVVGLNAXECAW-JTSJOTPCSA-N
Data  2 KI
PDB links: 1 PDB ID matches this monomer.
  Tab Delimited (TSV)   2D SDfile   Computed 3D by Vconf -m prep SDfile
Find this compound or compounds like it in BindingDB:
Activity Spreadsheet -- Enzyme Inhibition Constant Data from BindingDB
Found 2 hits for monomerid = 50448602
TargetCoagulation factor XI(Homo sapiens (Human))
Bristol-Myers Squibb
Curated by ChEMBL
LigandPNGBDBM50448602(CHEMBL3127473)
Affinity DataKi:  1.5nM. Assay description: Binding affinity to human factor 11a assessed as release of p-nitroaniline after 10 to 120 mins by spectrophotometric analysis
TargetCoagulation factor X(Homo sapiens (Human))
Bristol-Myers Squibb
Curated by ChEMBL
LigandPNGBDBM50448602(CHEMBL3127473)
Affinity DataKi:  3.00E+3nM. Assay description: Binding affinity to human factor 10a assessed as release of p-nitroaniline after 10 to 120 mins by spectrophotometric analysis
In DepthDetails ArticlePubMed