BDBM50449640 CHEMBL4172399
SMILES Nc1nc(NCc2ccco2)nc2sc(nc12)-c1ccco1
InChI Key InChIKey=NATVMWFSRHVEGA-UHFFFAOYSA-N
Data  2 KI  3 IC50
  Tab Delimited (TSV)   2D SDfile   Computed 3D by Vconf -m prep SDfile
Find this compound or compounds like it in BindingDB:
Activity Spreadsheet -- Enzyme Inhibition Constant Data from BindingDB
Found 5 hits for monomerid = 50449640
TargetAdenosine receptor A3(Homo sapiens (Human))
Universit£
Curated by ChEMBL
LigandPNGBDBM50449640(CHEMBL4172399)
Affinity DataKi:  4.70nM. Assay description: Displacement of [125I]AB-MECA from human adenosine A3 receptor expressed in CHO cell membranes measured after 120 mins by scintillation counting meth...
Ligand InfoPC cidPC sid
In DepthDetails ArticlePubMed
TargetAdenosine receptor A1(Homo sapiens (Human))
Universit£
Curated by ChEMBL
LigandPNGBDBM50449640(CHEMBL4172399)
Affinity DataKi:  38nM. Assay description: Displacement of [3H]DPCPX from human adenosine A1 receptor expressed in CHO cell membranes measured after 90 mins by scintillation counting method
Ligand InfoPC cidPC sid
In DepthDetails ArticlePubMed
TargetAdenosine receptor A2b(Homo sapiens (Human))
Universit£
Curated by ChEMBL
LigandPNGBDBM50449640(CHEMBL4172399)
Affinity DataIC50:  82nM. Assay description: Inverse agonist activity at human adenosine A2B receptor expressed in CHO cells assessed as inhibition of cAMP accumulation measured after 150 mins i...
Ligand InfoPC cidPC sid
In DepthDetails ArticlePubMed
TargetAdenosine receptor A2a(Homo sapiens (Human))
Universit£
Curated by ChEMBL
LigandPNGBDBM50449640(CHEMBL4172399)
Affinity DataIC50:  0.00160nM. Assay description: Inverse agonist activity at human adenosine A2A receptor expressed in CHO cells assessed as inhibition of cAMP accumulation measured after 150 mins i...
Ligand InfoPC cidPC sid
In DepthDetails ArticlePubMed
TargetAdenosine receptor A2a(Homo sapiens (Human))
Universit£
Curated by ChEMBL
LigandPNGBDBM50449640(CHEMBL4172399)
Affinity DataIC50:  0.0400nM. Assay description: Antagonist activity against human adenosine A2A receptor expressed in CHO cells assessed as inhibition of CGS21680-stimulated cAMP accumulation measu...
Ligand InfoPC cidPC sid
In DepthDetails ArticlePubMed