BDBM50450376 CHEMBL101865
SMILES CCCCCCCCCCCCn1nnc(n1)C(NC(=O)c1ccc(OC)cc1)c1ccccc1
InChI Key InChIKey=UCJCIJOVKXGQHD-UHFFFAOYSA-N
Data  1 IC50
  Tab Delimited (TSV)   2D SDfile   Computed 3D by Vconf -m prep SDfile
Find this compound or compounds like it in BindingDB:
Activity Spreadsheet -- Enzyme Inhibition Constant Data from BindingDB
Found 1 hit for monomerid = 50450376
TargetSterol O-acyltransferase 1(Rattus norvegicus)
TBA
Curated by ChEMBL
LigandPNGBDBM50450376(CHEMBL101865)
Affinity DataIC50:  600nM. Assay description: Concentration required for the in vitro inhibition of Acyl coenzyme A:cholesterol acyltransferase (ACAT) in liver microsomes isolated from cholestero...
In DepthDetails Article