BDBM50450884 CHEMBL4211782
SMILES CN(C)CCn1cc(Nc2nc(Oc3cccc(NC(=O)C=C)c3)c3cc[nH]c3n2)cn1
InChI Key InChIKey=UOJICKHILBQQNT-UHFFFAOYSA-N
Data  1 KI
  Tab Delimited (TSV)   2D SDfile   Computed 3D by Vconf -m prep SDfile
Find this compound or compounds like it in BindingDB:
Activity Spreadsheet -- Enzyme Inhibition Constant Data from BindingDB
Found 1 hit for monomerid = 50450884
TargetEpidermal growth factor receptor(Homo sapiens (Human))
Wuxi Apptec
Curated by ChEMBL
LigandPNGBDBM50450884(CHEMBL4211782)
Affinity DataKi:  3nM. Assay description: Inhibition of EGFR T790M/L858R double mutant (unknown origin)
Ligand InfoPC cidPC sid
In DepthDetails ArticlePubMed