BDBM50450986 CHEMBL101519
SMILES [H][C@@]12Oc3c4c(C[C@@]5([H])N(CC6CC6)CC[C@@]14[C@@]5(O)C\C(=C\c1ccccc1)C2=O)ccc3O
InChI Key InChIKey=WXOUFNFMPVMGFZ-XEGDMQTMSA-N
Data  4 KI
  Tab Delimited (TSV)   2D SDfile   Computed 3D by Vconf -m prep SDfile
Find this compound or compounds like it in BindingDB:
Activity Spreadsheet -- Enzyme Inhibition Constant Data from BindingDB
Found 4 hits for monomerid = 50450986
TargetDelta-type opioid receptor(Rattus norvegicus (rat))
National Institute Of Diabetes
Curated by ChEMBL
LigandPNGBDBM50450986(CHEMBL101519)
Affinity DataKi:  3.70nM. Assay description: Binding affinity evaluated by inhibition of binding of [3H]DADLE to delta opioid receptor of rat brain
In DepthDetails ArticlePubMed
TargetDelta-type opioid receptor(Homo sapiens (Human))
University Of Washington
Curated by ChEMBL
LigandPNGBDBM50450986(CHEMBL101519)
Affinity DataKi:  3.70nM. Assay description: Binding affinity was determined in a crude membrane preparation from guinea pig brain by displacement of [3H]DPDPE from Opioid receptor delta 1
In DepthDetails ArticlePubMed
TargetMu-type opioid receptor(GUINEA PIG)
University Of Washington
Curated by ChEMBL
LigandPNGBDBM50450986(CHEMBL101519)
Affinity DataKi:  33nM. Assay description: Binding affinity was determined in a crude membrane preparation from guinea pig brain by displacement of [3H]DAMGO from Opioid receptor mu 1
In DepthDetails ArticlePubMed
TargetKappa-type opioid receptor(Cavia porcellus (domestic guinea pig))
University Of Washington
Curated by ChEMBL
LigandPNGBDBM50450986(CHEMBL101519)
Affinity DataKi:  34nM. Assay description: Binding affinity was determined in a crude membrane preparation from guinea pig brain by displacement of [3H]U-69593 from Opioid receptor kappa 1
In DepthDetails ArticlePubMed