BDBM50451009 CHEMBL2374437
SMILES CCN(CC)C(=O)c1ccc(cc1)[C@@H](N1CCN(CC=C)CC1)c1cccc(OC)c1
InChI Key InChIKey=BYUQJNUSTSPWIV-RUZDIDTESA-N
Data  3 IC50
  Tab Delimited (TSV)   2D SDfile   Computed 3D by Vconf -m prep SDfile
Find this compound or compounds like it in BindingDB:
Activity Spreadsheet -- Enzyme Inhibition Constant Data from BindingDB
Found 3 hits for monomerid = 50451009
TargetKappa-type opioid receptor(Cavia porcellus (domestic guinea pig))
Organon Laboratories
Curated by ChEMBL
LigandPNGBDBM50451009(CHEMBL2374437)
Affinity DataIC50: >1.00E+4nM. Assay description: Binding affinity towards Opioid receptor kappa 1 using [3H]- U-69,593 (1.5 nM) as radioligand in guinea pig brain membranes
In DepthDetails ArticlePubMed
TargetMu-type opioid receptor(Rattus norvegicus (rat))
Organon Laboratories
Curated by ChEMBL
LigandPNGBDBM50451009(CHEMBL2374437)
Affinity DataIC50: >1.00E+4nM. Assay description: Binding affinity towards mu opioid receptor using [3H]- -DAMGO (1.5 nM) as radioligand in rat brain membranes
In DepthDetails ArticlePubMed
TargetDelta-type opioid receptor(Homo sapiens (Human))
Organon Laboratories
Curated by ChEMBL
LigandPNGBDBM50451009(CHEMBL2374437)
Affinity DataIC50:  7.40nM. Assay description: Binding inhibition of [3H]- -naltrindole (0.15 nM) to membranes in CHO cells expressing Opioid receptor delta 1
In DepthDetails ArticlePubMed