BDBM504519 (9-ethyl-6,6-dimethyl-11-oxo-8- (pyridin-4-yl)-6,11-dihydro-5H- benzo[b]carbazole-3-carbonitrile::US11066363, Compound 14
SMILES CCc1cc2C(=O)c3c([nH]c4cc(ccc34)C#N)C(C)(C)c2cc1-c1ccncc1
InChI Key InChIKey=IVUXRXIUHJUOGX-UHFFFAOYSA-N
Data  2 IC50
  Tab Delimited (TSV)   2D SDfile   Computed 3D by Vconf -m prep SDfile
Find this compound or compounds like it in BindingDB:
Activity Spreadsheet -- Enzyme Inhibition Constant Data from BindingDB
Found 2 hits for monomerid = 504519
TargetSRSF protein kinase 2(Homo sapiens (Human))
Dana-Farber Cancer Institute
US Patent
LigandPNGBDBM504519((9-ethyl-6,6-dimethyl-11-oxo-8- (pyridin-4-yl)-6,1...)
Affinity DataIC50:  13.2nM. Assay description: SRPK1 Inhibitory Activities of the Compounds.
Ligand InfoPC cidPC sid
In DepthDetails US Patent
TargetSRSF protein kinase 1(Homo sapiens (Human))
Dana-Farber Cancer Institute
US Patent
LigandPNGBDBM504519((9-ethyl-6,6-dimethyl-11-oxo-8- (pyridin-4-yl)-6,1...)
Affinity DataIC50:  2.61nM. Assay description: SRPK1 Inhibitory Activities of the Compounds.
Ligand InfoPC cidPC sid
In DepthDetails US Patent