BDBM50452009 CHEMBL4205201
SMILES CC(C)(C)c1ccc(cc1)C(=O)C(=N\Nc1cc(cc(c1)C(F)(F)F)C(F)(F)F)\C#N
InChI Key InChIKey=GNOZFEYFOKBSBX-OCSSWDANSA-N
Data  2 IC50
  Tab Delimited (TSV)   2D SDfile   Computed 3D by Vconf -m prep SDfile
Find this compound or compounds like it in BindingDB:
Activity Spreadsheet -- Enzyme Inhibition Constant Data from BindingDB
Found 2 hits for monomerid = 50452009
TargetRap guanine nucleotide exchange factor 3(Homo sapiens (Human))
University Of Texas Medical Branch
Curated by ChEMBL
LigandPNGBDBM50452009(CHEMBL4205201)
Affinity DataIC50:  5.50E+3nM. Assay description: Antagonist activity at recombinant full length EPAC1 (unknown origin) assessed as inhibition of cAMP-mediated Rap1b-BODIPY GDP nucleotide exchange ac...
Ligand InfoPC cidPC sid
In DepthDetails ArticlePubMed
TargetRap guanine nucleotide exchange factor 4(Homo sapiens (Human))
University Of Texas Medical Branch
Curated by ChEMBL
LigandPNGBDBM50452009(CHEMBL4205201)
Affinity DataIC50:  6.30E+3nM. Assay description: Antagonist activity at recombinant full length EPAC2 (unknown origin) assessed as inhibition of cAMP-mediated Rap1b-BODIPY GDP nucleotide exchange ac...
Ligand InfoPC cidPC sid
In DepthDetails ArticlePubMed