BDBM50452306 CHEMBL4211105
SMILES Fc1ccc(Cn2ccc(NC(=O)Cc3ccc(OC4CC(F)(F)C4)cc3)n2)cc1F
InChI Key InChIKey=MPAMSENUCHVPRE-UHFFFAOYSA-N
Data  3 IC50
  Tab Delimited (TSV)   2D SDfile   Computed 3D by Vconf -m prep SDfile
Find this compound or compounds like it in BindingDB:
Activity Spreadsheet -- Enzyme Inhibition Constant Data from BindingDB
Found 3 hits for monomerid = 50452306
TargetVoltage-dependent T-type calcium channel subunit alpha-1I(Homo sapiens (Human))
Idorsia Pharmaceuticals
Curated by ChEMBL
LigandPNGBDBM50452306(CHEMBL4211105)
Affinity DataIC50:  6.10nM. Assay description: Inhibition of recombinant Cav3.3 (unknown origin) expressed in HEK293 cells assessed as decrease in calcium flux preincubated for 3 mins followed by ...
Ligand InfoPC cidPC sid
In DepthDetails ArticlePubMed
TargetVoltage-dependent T-type calcium channel subunit alpha-1H(Homo sapiens (Human))
Idorsia Pharmaceuticals
Curated by ChEMBL
LigandPNGBDBM50452306(CHEMBL4211105)
Affinity DataIC50:  11nM. Assay description: Inhibition of recombinant Cav3.2 (unknown origin) expressed in HEK293 cells assessed as decrease in calcium flux preincubated for 3 mins followed by ...
Ligand InfoPC cidPC sid
In DepthDetails ArticlePubMed
TargetVoltage-dependent T-type calcium channel subunit alpha-1G(Homo sapiens (Human))
Idorsia Pharmaceuticals
Curated by ChEMBL
LigandPNGBDBM50452306(CHEMBL4211105)
Affinity DataIC50:  1.40nM. Assay description: Inhibition of recombinant Cav3.1 (unknown origin) expressed in HEK293 cells assessed as decrease in calcium flux preincubated for 3 mins followed by ...
Ligand InfoPC cidPC sid
In DepthDetails ArticlePubMed