BDBM50452556 CHEMBL4210405::US11028051, Cmpd 53
SMILES CC(C)OC(=O)N[C@@H]1C[C@H](C)N(C(C)=O)c2ccc(cc12)-c1ccsc1
InChI Key InChIKey=VDHPCDUFNMXSRQ-SCLBCKFNSA-N
Data  2 IC50  6 Kd
  Tab Delimited (TSV)   2D SDfile   Computed 3D by Vconf -m prep SDfile
Find this compound or compounds like it in BindingDB:
Activity Spreadsheet -- Enzyme Inhibition Constant Data from BindingDB
Found 8 hits for monomerid = 50452556
TargetBromodomain-containing protein 2(Homo sapiens (Human))
St. Jude Children'S Research Hospital
Curated by ChEMBL
LigandPNGBDBM50452556(CHEMBL4210405 | US11028051, Cmpd 53)
Affinity DataIC50:  5.21E+3nM. Assay description: Inhibition of recombinant human BRD2 bromodomain 1 (49 to 170 residues) using biotin labeled peptide substrate preincubated for 15 mins followed by s...
Ligand InfoPC cidPC sid
In DepthDetails ArticlePubMed
TargetBromodomain-containing protein 2(Homo sapiens (Human))
St. Jude Children'S Research Hospital
Curated by ChEMBL
LigandPNGBDBM50452556(CHEMBL4210405 | US11028051, Cmpd 53)
Affinity DataIC50:  1.08E+3nM. Assay description: Inhibition of recombinant human BRD2 bromodomain 2 (342 to 460 residues) using biotin labeled peptide substrate preincubated for 15 mins followed by ...
Ligand InfoPC cidPC sid
In DepthDetails ArticlePubMed
TargetBromodomain-containing protein 2(Homo sapiens (Human))
St. Jude Children'S Research Hospital
Curated by ChEMBL
LigandPNGBDBM50452556(CHEMBL4210405 | US11028051, Cmpd 53)
Affinity DataKd:  17nM. Assay description: Binding affinity to BRD2 bromodomain 2 (348 to 455 residues) (unknown origin) by ITC
Ligand InfoPC cidPC sid
In DepthDetails ArticlePubMed
TargetBromodomain-containing protein 2 [348-455](Homo sapiens (Human))
St. Jude Children'S Research Hospital
US Patent
LigandPNGBDBM50452556(CHEMBL4210405 | US11028051, Cmpd 53)
Affinity DataKd:  17nM. Assay description: Binding of compounds to BRD2 was monitored using an ITC200 (Microcal, Piscataway, N.J.). Either Brd2.1 (74-194) or Brd2.2 (348-455) was dialyzed over...
Ligand InfoPC cidPC sid
In DepthDetails US Patent
TargetBromodomain-containing protein 2(Homo sapiens (Human))
St. Jude Children'S Research Hospital
Curated by ChEMBL
LigandPNGBDBM50452556(CHEMBL4210405 | US11028051, Cmpd 53)
Affinity DataKd:  72nM. Assay description: Binding affinity to His-tagged BRD2 bromodomain 2 (unknown origin) by SPR assay
Ligand InfoPC cidPC sid
In DepthDetails ArticlePubMed
TargetBromodomain-containing protein 2(Homo sapiens (Human))
St. Jude Children'S Research Hospital
Curated by ChEMBL
LigandPNGBDBM50452556(CHEMBL4210405 | US11028051, Cmpd 53)
Affinity DataKd:  72nM. Assay description: Binding affinity to BRD2 bromodomain 1 (74 to 194 residues) (unknown origin) by ITC
Ligand InfoPC cidPC sid
In DepthDetails ArticlePubMed
TargetBromodomain-containing protein 2 [74-94](Homo sapiens (Human))
St. Jude Children'S Research Hospital
US Patent
LigandPNGBDBM50452556(CHEMBL4210405 | US11028051, Cmpd 53)
Affinity DataKd:  72nM. Assay description: Binding of compounds to BRD2 was monitored using an ITC200 (Microcal, Piscataway, N.J.). Either Brd2.1 (74-194) or Brd2.2 (348-455) was dialyzed over...
Ligand InfoPC cidPC sid
In DepthDetails US Patent
TargetBromodomain-containing protein 2(Homo sapiens (Human))
St. Jude Children'S Research Hospital
Curated by ChEMBL
LigandPNGBDBM50452556(CHEMBL4210405 | US11028051, Cmpd 53)
Affinity DataKd:  105nM. Assay description: Binding affinity to His-tagged BRD2 bromodomain 1 (unknown origin) by SPR assay
Ligand InfoPC cidPC sid
In DepthDetails ArticlePubMed