BDBM50453057 CHEMBL3085527
SMILES CC[C@H](C)[C@H](NC(=O)[C@H](C\C=C\c1ccccc1)C[C@H](O)[C@H](Cc1ccccc1)NC(=O)OC(C)(C)C)C(=O)NCc1nc2ccccc2[nH]1
InChI Key InChIKey=XETIIHXJGVJJAT-FGXUATOGSA-N
Data  1 IC50
  Tab Delimited (TSV)   2D SDfile   Computed 3D by Vconf -m prep SDfile
Find this compound or compounds like it in BindingDB:
Activity Spreadsheet -- Enzyme Inhibition Constant Data from BindingDB
Found 1 hit for monomerid = 50453057
TargetGag-Pol polyprotein [489-587](Human immunodeficiency virus type 1)
Merck Sharp And Dohme Research Laboratories
Curated by ChEMBL
LigandPNGBDBM50453057(CHEMBL3085527)
Affinity DataIC50:  0.0300nM. Assay description: The compound was tested for its affinity against HIV-1 protease
In DepthDetails ArticlePubMed