BDBM50453081 CHEMBL2374397
SMILES Nc1nc(NCCCC2CCCCC2)nc2n(cnc12)[C@@H]1O[C@H](CO)[C@@H](O)[C@H]1O
InChI Key InChIKey=YWTNWNBTHSNVRD-SCFUHWHPSA-N
Data  2 IC50
  Tab Delimited (TSV)   2D SDfile   Computed 3D by Vconf -m prep SDfile
Find this compound or compounds like it in BindingDB:
Activity Spreadsheet -- Enzyme Inhibition Constant Data from BindingDB
Found 2 hits for monomerid = 50453081
TargetAdenosine receptor A2a/A2b(Rattus norvegicus)
Ciba-Geigy
Curated by ChEMBL
LigandPNGBDBM50453081(CHEMBL2374397)
Affinity DataIC50:  132nM. Assay description: Concentration required for 50% inhibition of [3H]NECA binding on rat brain adenosine A2 receptor
In DepthDetails ArticlePubMed
TargetAdenosine receptor A1(Rattus norvegicus (rat))
Ciba-Geigy
Curated by ChEMBL
LigandPNGBDBM50453081(CHEMBL2374397)
Affinity DataIC50:  8.32E+3nM. Assay description: Concentration required for 50% inhibition of [3H]-CHA binding on rat brain adenosine A1 receptor
In DepthDetails ArticlePubMed