BDBM50453217 CHEMBL2113506
SMILES CC(O)C#Cc1nc(N)c2ncn([C@@H]3O[C@H](CO)[C@@H](O)[C@H]3O)c2n1
InChI Key InChIKey=VDHYEXXQSBQMES-MPMFQPDFSA-N
Data  2 KI
  Tab Delimited (TSV)   2D SDfile   Computed 3D by Vconf -m prep SDfile
Find this compound or compounds like it in BindingDB:
Activity Spreadsheet -- Enzyme Inhibition Constant Data from BindingDB
Found 2 hits for monomerid = 50453217
TargetAdenosine receptor A1(Rattus norvegicus (rat))
Yamasa Shoyu
Curated by ChEMBL
LigandPNGBDBM50453217(CHEMBL2113506)
Affinity DataKi:  15nM. Assay description: Inhibition of [3H]CHA binding to adenosine A1 receptor from rat brain membranes
In DepthDetails ArticlePubMed
TargetAdenosine receptor A2a/A2b(Rattus norvegicus)
Yamasa Shoyu
Curated by ChEMBL
LigandPNGBDBM50453217(CHEMBL2113506)
Affinity DataKi:  18nM. Assay description: Inhibition of [3H]NECA binding to adenosine A2 receptor from rat striatal membranes
In DepthDetails ArticlePubMed