BDBM504542 (R)-3-(2,5-Difluoro-4-(5-(trifluoromethyl)-1,2,4-oxadiazol-3-yl)phenyl)-4-phenyloxazolidin-2-one::US11066396, Example 16
SMILES Fc1cc(-c2noc(n2)C(F)(F)F)c(F)cc1N1[C@@H](COC1=O)c1ccccc1
InChI Key InChIKey=GMRFDGKVPQDNRD-AWEZNQCLSA-N
Data  4 IC50
  Tab Delimited (TSV)   2D SDfile   Computed 3D by Vconf -m prep SDfile
Find this compound or compounds like it in BindingDB:
Activity Spreadsheet -- Enzyme Inhibition Constant Data from BindingDB
Found 4 hits for monomerid = 504542
TargetHistone deacetylase 6(Homo sapiens (Human))
Merck Sharp & Dohme
US Patent
LigandPNGBDBM504542((R)-3-(2,5-Difluoro-4-(5-(trifluoromethyl)-1,2,4-o...)
Affinity DataIC50:  5.60nM. Assay description: HDAC1 and 6 reagents: FLAG-tagged HDACs 1 and 6 were prepared in-house by protein expression in HEK293F cells followed by anti-FLAG affinity purifica...
Ligand InfoPC cidPC sid
In DepthDetails US Patent
TargetHistone deacetylase 8(Homo sapiens (Human))
Merck Sharp & Dohme
US Patent
LigandPNGBDBM504542((R)-3-(2,5-Difluoro-4-(5-(trifluoromethyl)-1,2,4-o...)
Affinity DataIC50:  6.00E+3nM. Assay description: HDAC8 reagents: HDAC8 was purchased from Enzo Life Sciences [catalog #BML-SE145]. Assays were performed with buffer containing 20 mM HEPES, pH 8.0 [B...
Ligand InfoPC cidPC sid
In DepthDetails US Patent
TargetHistone deacetylase 5(Homo sapiens (Human))
Merck Sharp & Dohme
US Patent
LigandPNGBDBM504542((R)-3-(2,5-Difluoro-4-(5-(trifluoromethyl)-1,2,4-o...)
Affinity DataIC50:  19nM. Assay description: HDAC5 reagents: N-terminal GST tagged HDAC5 was purchased from BPS Bioscience [catalog #50045]. Assays were performed with buffer containing 20 mM HE...
Ligand InfoPC cidPC sid
In DepthDetails US Patent
TargetHistone deacetylase 1(Homo sapiens (Human))
Merck Sharp & Dohme
US Patent
LigandPNGBDBM504542((R)-3-(2,5-Difluoro-4-(5-(trifluoromethyl)-1,2,4-o...)
Affinity DataIC50:  1.00E+3nM. Assay description: HDAC1 and 6 reagents: FLAG-tagged HDACs 1 and 6 were prepared in-house by protein expression in HEK293F cells followed by anti-FLAG affinity purifica...
Ligand InfoPC cidPC sid
In DepthDetails US Patent