BDBM50454481 CHEMBL2110201
SMILES CN1c2ccccc2C(=N[C@@H](NC(=O)Nc2ccc(C)c(Nc3nn[nH]n3)c2)C1=O)C1CCCCC1
InChI Key InChIKey=OOGNGOKKKSYZQA-QFIPXVFZSA-N
Data  2 IC50
  Tab Delimited (TSV)   2D SDfile   Computed 3D by Vconf -m prep SDfile
Find this compound or compounds like it in BindingDB:
Activity Spreadsheet -- Enzyme Inhibition Constant Data from BindingDB
Found 2 hits for monomerid = 50454481
TargetGastrin/cholecystokinin type B receptor(Homo sapiens (Human))
Neuroscience Research Centre
Curated by ChEMBL
LigandPNGBDBM50454481(CHEMBL2110201)
Affinity DataIC50:  0.0740nM. Assay description: Inhibition of [125 I]BH CCK-8S binding to Cholecystokinin type B receptor in guinea pig cortical membranes
In DepthDetails ArticlePubMed
TargetCholecystokinin receptor type A(RAT)
Neuroscience Research Centre
Curated by ChEMBL
LigandPNGBDBM50454481(CHEMBL2110201)
Affinity DataIC50:  802nM. Assay description: Inhibition of [125 I]BH CCK-8S binding to Cholecystokinin type A receptor in pancreatic tissue
In DepthDetails ArticlePubMed