BDBM50454759 Flesinoxan
SMILES [H][C@]1(CO)COc2c(O1)cccc2N1CCN(CCNC(=O)c2ccc(F)cc2)CC1
InChI Key InChIKey=NYSDRDDQELAVKP-SFHVURJKSA-N
Data  3 KI  1 EC50
  Tab Delimited (TSV)   2D SDfile   Computed 3D by Vconf -m prep SDfile
Find this compound or compounds like it in BindingDB:
Activity Spreadsheet -- Enzyme Inhibition Constant Data from BindingDB
Found 4 hits for monomerid = 50454759
Target5-hydroxytryptamine receptor 1A(Rattus norvegicus (rat))
Solvay Pharma
Curated by ChEMBL
LigandPNGBDBM50454759(Flesinoxan)
Affinity DataKi:  1.70nM. Assay description: Inhibition of [3H]8-OH-DPAT binding to 5-hydroxytryptamine 1A receptor of rat frontal cortex membranes
In DepthDetails ArticlePubMed
Target5-hydroxytryptamine receptor 1A(Rattus norvegicus (rat))
Solvay Pharma
Curated by ChEMBL
LigandPNGBDBM50454759(Flesinoxan)
Affinity DataKi:  1.70nM. Assay description: Binding affinity was evaluated by determining in vitro displacement of [3H]-8-OH-DPAT from the central 5-hydroxytryptamine 1A receptor recognition si...
In DepthDetails ArticlePubMed
TargetD(2) dopamine receptor(Rattus norvegicus (rat))
Solvay Pharma
Curated by ChEMBL
LigandPNGBDBM50454759(Flesinoxan)
Affinity DataKi:  140nM. Assay description: In vitro displacement of [3H]-spiperone from Dopamine receptor D2 binding site in rat striatum.
In DepthDetails ArticlePubMed
Target5-hydroxytryptamine receptor 1A(Homo sapiens (Human))
Solvay Pharma
Curated by ChEMBL
LigandPNGBDBM50454759(Flesinoxan)
Affinity DataEC50:  6.60nM. Assay description: Compound was tested for its potency against human 5-hydroxytryptamine 1A receptor expressed in CHO cells
In DepthDetails ArticlePubMed