BDBM50454946 CHEMBL79602
SMILES CN(C)c1ccc(CN(Cc2cccc(c2)-c2cc[nH]n2)C(=O)Nc2c(F)cc(F)cc2F)cc1
InChI Key InChIKey=YKPWIOMOALIGCF-UHFFFAOYSA-N
Data  1 IC50
  Tab Delimited (TSV)   2D SDfile   Computed 3D by Vconf -m prep SDfile
Find this compound or compounds like it in BindingDB:
Activity Spreadsheet -- Enzyme Inhibition Constant Data from BindingDB
Found 1 hit for monomerid = 50454946
TargetAcyl-CoA:cholesterol acyltransferase(Oryctolagus cuniculus)
Fujisawa Pharmaceutical
Curated by ChEMBL
LigandPNGBDBM50454946(CHEMBL79602)
Affinity DataIC50:  12nM. Assay description: In vitro inhibitory activity against Acyl coenzyme A:cholesterol acyltransferase (ACAT) in rabbit intestinal microsomes
In DepthDetails ArticlePubMed