BDBM50455595 CHEMBL2112338
SMILES C[C@@](Cc1c[nH]c2ccccc12)(NC(=O)OC1C2CC3CC(C2)CC1C3)C(=O)NC[C@@H](NC(=O)CCS([O-])(=O)=O)c1ccccc1
InChI Key InChIKey=JBMIYNKWSXTQIH-ODTYTMEJSA-M
Data  2 IC50
  Tab Delimited (TSV)   2D SDfile   Computed 3D by Vconf -m prep SDfile
Find this compound or compounds like it in BindingDB:
Activity Spreadsheet -- Enzyme Inhibition Constant Data from BindingDB
Found 2 hits for monomerid = 50455595
TargetCholecystokinin receptor type A(RAT)
Parke-Davis Neuroscience Research Centre
Curated by ChEMBL
LigandPNGBDBM50455595(CHEMBL2112338)
Affinity DataIC50:  1.01E+3nM. Assay description: Evaluated for inhibition of cholecystokinin type A receptor by displacing [125I]bolton hunter CCK-8 radioligand in the rat pancreas
In DepthDetails ArticlePubMed
TargetGastrin/cholecystokinin type B receptor(MOUSE)
Parke-Davis Neuroscience Research Centre
Curated by ChEMBL
LigandPNGBDBM50455595(CHEMBL2112338)
Affinity DataIC50:  1.30nM. Assay description: Evaluated for inhibition of cholecystokinin type B receptor by displacing [125I]-Bolton hunter CCK-8 radioligand in the mouse cerebral cortex
In DepthDetails ArticlePubMed