BDBM50457104 CHEMBL4217235
SMILES Cc1ccc(nc1)N1CCN(CCn2c3nc(N)n4nc(nc4c3n(C)c2=O)-c2ccco2)CC1
InChI Key InChIKey=YJMHRFTVOKUYAI-UHFFFAOYSA-N
Data  3 KI
  Tab Delimited (TSV)   2D SDfile   Computed 3D by Vconf -m prep SDfile
Find this compound or compounds like it in BindingDB:
Activity Spreadsheet -- Enzyme Inhibition Constant Data from BindingDB
Found 3 hits for monomerid = 50457104
TargetAdenosine receptor A2a(Homo sapiens (Human))
Advinus Therapeutics
Curated by ChEMBL
LigandPNGBDBM50457104(CHEMBL4217235)
Affinity DataKi:  0.400nM. Assay description: Antagonist activity at human A2A receptor expressed in HEK293 cell membranes assessed as reduction in CGS-21680-induced cAMP level pretreated for 15 ...
Ligand InfoPC cidPC sid
In DepthDetails ArticlePubMed
TargetAdenosine receptor A2a(Rattus norvegicus (rat))
Advinus Therapeutics
Curated by ChEMBL
LigandPNGBDBM50457104(CHEMBL4217235)
Affinity DataKi:  0.650nM. Assay description: Antagonist activity at rat A2A receptor assessed as reduction in CGS-21680-induced cAMP level pretreated for 15 mins followed by CGS-21680 addition m...
Ligand InfoPC cidPC sid
In DepthDetails ArticlePubMed
TargetAdenosine receptor A2a(Homo sapiens (Human))
Advinus Therapeutics
Curated by ChEMBL
LigandPNGBDBM50457104(CHEMBL4217235)
Affinity DataKi:  1.70nM. Assay description: Displacement of [3H]ZM241385 from human A2A receptor expressed in HEK293 cell membranes after 90 mins radioligand binding assay
Ligand InfoPC cidPC sid
In DepthDetails ArticlePubMed