BDBM50462690 CHEMBL4242494
SMILES CC(C)c1cccc(C(C)C)c1NC(=O)CCCCCSc1nc2cccc(N(C)C)c2o1
InChI Key InChIKey=UQQOZNMYQMWJSC-UHFFFAOYSA-N
Data  2 IC50
  Tab Delimited (TSV)   2D SDfile   Computed 3D by Vconf -m prep SDfile
Find this compound or compounds like it in BindingDB:
Activity Spreadsheet -- Enzyme Inhibition Constant Data from BindingDB
Found 2 hits for monomerid = 50462690
TargetSterol O-acyltransferase 1(Homo sapiens (Human))
Kowa
Curated by ChEMBL
LigandPNGBDBM50462690(CHEMBL4242494)
Affinity DataIC50:  820nM. Assay description: Inhibition of ACAT in human J774A.1 cells assessed as reduction in esterified-cholesterol accumulation after 18 hrs in presence of 25-hydroxycholeste...
Ligand InfoPC cidPC sid
In DepthDetails ArticlePubMed
TargetSterol O-acyltransferase 1(Mus musculus)
Kowa
Curated by ChEMBL
LigandPNGBDBM50462690(CHEMBL4242494)
Affinity DataIC50:  800nM. Assay description: Inhibition of ACAT1 in mouse J774 cells assessed as reduction in esterified cholesterol accumulation after 18 hrs in presence of 25-hydroxycholestero...
Ligand InfoPC cidPC sid
In DepthDetails ArticlePubMed