BDBM50465482 CHEMBL4288628
SMILES Cn1cc(cn1)-c1c[nH]c(=O)c(N)c1
InChI Key InChIKey=ZGGRJKLRPVNTDT-UHFFFAOYSA-N
Data  3 KI
PDB links: 1 PDB ID matches this monomer.
  Tab Delimited (TSV)   2D SDfile   Computed 3D by Vconf -m prep SDfile
Find this compound or compounds like it in BindingDB:
Activity Spreadsheet -- Enzyme Inhibition Constant Data from BindingDB
Found 3 hits for monomerid = 50465482
TargetAurora kinase B/Inner centromere protein(Homo sapiens (Human))
The Institute Of Cancer Research
Curated by ChEMBL
LigandPNGBDBM50465482(CHEMBL4288628)
Affinity DataKi:  3.20E+3nM. Assay description: Inhibition of human full length N-terminal GST-tagged Aurora B (1 to 344 end residues)/His-tagged INCENP (803 to 918 end residues) expressed in bacul...
Ligand InfoPC cidPC sidPDB
In DepthDetails ArticlePubMed
TargetAurora kinase A(Homo sapiens (Human))
The Institute Of Cancer Research
Curated by ChEMBL
LigandPNGBDBM50465482(CHEMBL4288628)
Affinity DataKi:  7.50E+3nM. Assay description: Inhibition of full length N-terminal His-tagged Aurora A (unknown origin) using fluorescence-labeled FL-Peptide 21 as substrate after 60 mins in pres...
Ligand InfoPC cidPC sidPDB
In DepthDetails ArticlePubMed
TargetDual specificity protein kinase TTK(Homo sapiens (Human))
The Institute Of Cancer Research
Curated by ChEMBL
LigandPNGBDBM50465482(CHEMBL4288628)
Affinity DataKi:  9.47E+4nM. Assay description: Inhibition of full length human Mps1 using fluorescence-labeled H236 peptide as substrate after 60 to 90 mins in presence of ATP by fluorescence assa...
Ligand InfoPC cidPC sidPDB