BDBM50465705 CHEMBL258912
SMILES [H][C@@]1(CCOC1=O)NC(=O)Cc1cccc(I)c1
InChI Key InChIKey=KBUNROHADPJPKR-JTQLQIEISA-N
Data  1 IC50
  Tab Delimited (TSV)   2D SDfile   Computed 3D by Vconf -m prep SDfile
Find this compound or compounds like it in BindingDB:
Activity Spreadsheet -- Enzyme Inhibition Constant Data from BindingDB
Found 1 hit for monomerid = 50465705
TargetTranscriptional activator protein LasR(Pseudomonas aeruginosa)
University Of Nottingham
Curated by ChEMBL
LigandPNGBDBM50465705(CHEMBL258912)
Affinity DataIC50:  1.72E+3nM. Assay description: Antagonist activity at Pseudomonas aeruginosa LasR expressed in Escherichia coli DH5alpha assessed as inhibition of protein interaction with OdDHL af...
Ligand InfoKEGGPC cidPC sid
In DepthDetails ArticlePubMed