BDBM50466751 CHEMBL4286811
SMILES CC(C)c1cccc(C(C)C)c1NC(=O)Cc1cccc(CSc2nc3ccccc3o2)c1
InChI Key InChIKey=ITTYDNSRIGTMKH-UHFFFAOYSA-N
Data  1 IC50
  Tab Delimited (TSV)   2D SDfile   Computed 3D by Vconf -m prep SDfile
Find this compound or compounds like it in BindingDB:
Activity Spreadsheet -- Enzyme Inhibition Constant Data from BindingDB
Found 1 hit for monomerid = 50466751
TargetSterol O-acyltransferase 1(Homo sapiens (Human))
Kowa
Curated by ChEMBL
LigandPNGBDBM50466751(CHEMBL4286811)
Affinity DataIC50:  1.60E+3nM. Assay description: Inhibition of ACAT in human J774A.1 cells assessed as reduction in esterified-cholesterol accumulation after 18 hrs in presence of 25-hydroxycholeste...
Ligand InfoPC cidPC sid
In DepthDetails ArticlePubMed