BDBM50466992 CHEMBL4289114
SMILES FC(F)(F)c1cc(Br)cc(c1)-c1ncsc1C(=O)c1ccccc1Cl
InChI Key InChIKey=YCNNTLXYIAKFTK-UHFFFAOYSA-N
Data  2 IC50
  Tab Delimited (TSV)   2D SDfile   Computed 3D by Vconf -m prep SDfile
Find this compound or compounds like it in BindingDB:
Activity Spreadsheet -- Enzyme Inhibition Constant Data from BindingDB
Found 2 hits for monomerid = 50466992
TargetNuclear receptor ROR-beta(Homo sapiens (Human))
The Scripps Research Institute
Curated by ChEMBL
LigandPNGBDBM50466992(CHEMBL4289114)
Affinity DataIC50:  26nM. Assay description: Displacement of [3H]-T0901317 from recombinant human His-SUMO-tagged RORbeta LBD (71 to 459 residues) expressed in Escherichia coli BL21(DE3) after 1...
Ligand InfoPC cidPC sid
In DepthDetails ArticlePubMed
TargetNuclear receptor ROR-gamma(Homo sapiens (Human))
The Scripps Research Institute
Curated by ChEMBL
LigandPNGBDBM50466992(CHEMBL4289114)
Affinity DataIC50:  6.80E+3nM. Assay description: Displacement of [3H]-T0901317 from recombinant human His-SUMO-tagged RORgamma LBD (265 to 518 residues) expressed in Escherichia coli BL21(DE3) after...
Ligand InfoPC cidPC sid
In DepthDetails ArticlePubMed