BDBM50468431 CHEMBL408326
SMILES [H][C@@]1(CCOC1=O)NS(=O)(=O)CCCCCCCCCCC
InChI Key InChIKey=VORQHUVHBIHSJY-AWEZNQCLSA-N
Data  1 EC50
  Tab Delimited (TSV)   2D SDfile   Computed 3D by Vconf -m prep SDfile
Find this compound or compounds like it in BindingDB:
Activity Spreadsheet -- Enzyme Inhibition Constant Data from BindingDB
Found 1 hit for monomerid = 50468431
TargetQuorum-sensing transcriptional repressor QscR(Pseudomonas aeruginosa)
University Of Wisconsin-Madison
Curated by ChEMBL
LigandPNGBDBM50468431(CHEMBL408326)
Affinity DataEC50:  1.59E+3nM. Assay description: Agonist activity at Pseudomonas aeruginosa QscR expressed in Escherichia coli JLD271 harboring QscR expression plasmid pJN105Q and pPA1897-lacZ trans...
Ligand InfoPC cidPC sid
In DepthDetails ArticlePubMed