BDBM50472448 CHEMBL344104
SMILES [H][C@@](Cc1cccc(c1)C(N)=N)(NS(=O)(=O)c1cccc2ccccc12)C(=O)N1CCCCC1
InChI Key InChIKey=SFYGGBIILXMJDK-QFIPXVFZSA-N
Data  3 KI
  Tab Delimited (TSV)   2D SDfile   Computed 3D by Vconf -m prep SDfile
Find this compound or compounds like it in BindingDB:
Activity Spreadsheet -- Enzyme Inhibition Constant Data from BindingDB
Found 3 hits for monomerid = 50472448
TargetProthrombin(Bos taurus (Bovine))
University Of Marburg
Curated by ChEMBL
LigandPNGBDBM50472448(CHEMBL344104)
Affinity DataKi:  230nM. Assay description: Binding affinity towards thrombin
Ligand InfoPC cidPC sid
In DepthDetails ArticlePubMed
TargetSerine protease 1(Bos taurus (bovine))
University Of Marburg
Curated by ChEMBL
LigandPNGBDBM50472448(CHEMBL344104)
Affinity DataKi:  609nM. Assay description: Binding affinity towards trypsin
Ligand InfoPC cidPC sid
In DepthDetails ArticlePubMed
TargetCoagulation factor X(Homo sapiens (Human))
University Of Marburg
Curated by ChEMBL
LigandPNGBDBM50472448(CHEMBL344104)
Affinity DataKi:  1.69E+4nM. Assay description: Binding affinity towards Coagulation factor Xa
Ligand InfoPC cidPC sid
In DepthDetails ArticlePubMed