BDBM50472475 CHEMBL356295
SMILES [H][C@@](Cc1cccc(c1)C(N)=N)(NS(=O)(=O)c1ccc(C)cc1)C(=O)N1CCOCC1
InChI Key InChIKey=SNFZMGVRIRZHBI-IBGZPJMESA-N
Data  3 KI
  Tab Delimited (TSV)   2D SDfile   Computed 3D by Vconf -m prep SDfile
Find this compound or compounds like it in BindingDB:
Activity Spreadsheet -- Enzyme Inhibition Constant Data from BindingDB
Found 3 hits for monomerid = 50472475
TargetProthrombin(Bos taurus (Bovine))
University Of Marburg
Curated by ChEMBL
LigandPNGBDBM50472475(CHEMBL356295)
Affinity DataKi:  170nM. Assay description: Binding affinity towards thrombin
Ligand InfoPC cidPC sid
In DepthDetails ArticlePubMed
TargetSerine protease 1(Bos taurus (bovine))
University Of Marburg
Curated by ChEMBL
LigandPNGBDBM50472475(CHEMBL356295)
Affinity DataKi:  709nM. Assay description: Binding affinity towards trypsin
Ligand InfoPC cidPC sid
In DepthDetails ArticlePubMed
TargetCoagulation factor X(Homo sapiens (Human))
University Of Marburg
Curated by ChEMBL
LigandPNGBDBM50472475(CHEMBL356295)
Affinity DataKi:  5.19E+4nM. Assay description: Binding affinity towards Coagulation factor Xa
Ligand InfoPC cidPC sid
In DepthDetails ArticlePubMed