BDBM50472505 CHEMBL141782
SMILES [H][C@@](Cc1cccc(c1)C(N)=N)(NS(=O)(=O)c1c(C)c(C)c2OC(C)(C)CCc2c1C)C(=O)N1CCN(CC1)S(C)(=O)=O
InChI Key InChIKey=ONUNOWVVELQNRN-DEOSSOPVSA-N
Data  3 KI
  Tab Delimited (TSV)   2D SDfile   Computed 3D by Vconf -m prep SDfile
Find this compound or compounds like it in BindingDB:
Activity Spreadsheet -- Enzyme Inhibition Constant Data from BindingDB
Found 3 hits for monomerid = 50472505
TargetProthrombin(Bos taurus (Bovine))
University Of Marburg
Curated by ChEMBL
LigandPNGBDBM50472505(CHEMBL141782)
Affinity DataKi:  7.40nM. Assay description: Binding affinity towards thrombin
Ligand InfoPC cidPC sid
In DepthDetails ArticlePubMed
TargetSerine protease 1(Bos taurus (bovine))
University Of Marburg
Curated by ChEMBL
LigandPNGBDBM50472505(CHEMBL141782)
Affinity DataKi:  760nM. Assay description: Binding affinity towards trypsin
Ligand InfoPC cidPC sid
In DepthDetails ArticlePubMed
TargetCoagulation factor X(Homo sapiens (Human))
University Of Marburg
Curated by ChEMBL
LigandPNGBDBM50472505(CHEMBL141782)
Affinity DataKi:  7.41E+4nM. Assay description: Binding affinity towards Coagulation factor Xa
Ligand InfoPC cidPC sid
In DepthDetails ArticlePubMed