BDBM50474842 CHEMBL365404
SMILES COc1cc(CN(CCc2ccccn2)C(=O)C2CC2c2ccccc2)ccc1OCc1ccccc1
InChI Key InChIKey=WUCPBGMDXNJIMY-UHFFFAOYSA-N
Data  1 IC50
  Tab Delimited (TSV)   2D SDfile   Computed 3D by Vconf -m prep SDfile
Find this compound or compounds like it in BindingDB:
Activity Spreadsheet -- Enzyme Inhibition Constant Data from BindingDB
Found 1 hit for monomerid = 50474842
LigandPNGBDBM50474842(CHEMBL365404)
Affinity DataIC50:  1.05E+4nM. Assay description: Inhibition of EGF-stimulated Elk1-luciferase reporter assay in HeLa cells
Ligand InfoPC cidPC sid
In DepthDetails ArticlePubMed