BDBM50477128 CHEMBL238217::GRL-0155S
SMILES [H][C@@]1([#6]-[#6@H](-[#7]-[#6](=O)-[#6@H](-[#6]\[#6]=[#6](\[#6])-[#6])-[#6]-[#6](=O)-[#6@@H](-[#7]-[#6](=O)-[#6@H](-[#6]-[#8])-[#7]-[#6](=O)-[#8]C([#6])([#6])[#6])-[#6](-[#6])-[#6])\[#6]=[#6]\[#6](=O)-[#8]-[#6]-[#6])[#6]-[#6]-[#7]-[#6]1=O
InChI Key InChIKey=ZQTRLNLQBUBFLO-OROCXDGXSA-N
Data  1 IC50
  Tab Delimited (TSV)   2D SDfile   Computed 3D by Vconf -m prep SDfile
Find this compound or compounds like it in BindingDB:
Activity Spreadsheet -- Enzyme Inhibition Constant Data from BindingDB
Found 1 hit for monomerid = 50477128
TargetReplicase polyprotein 1ab(Human SARS coronavirus (SARS-CoV) (Severe acute re...)
Purdue University
Curated by ChEMBL
LigandPNGBDBM50477128(CHEMBL238217 | GRL-0155S)
Affinity DataIC50:  8.00E+4nM. Assay description: Inhibition of SARS-CoV 3C-like protease by FRET based microplate assay
Ligand InfoPC cidPC sid
In DepthDetails ArticlePubMed