BDBM50477129 CHEMBL397154::acs.jmedchem.1c00409_ST.512
SMILES [H][C@@]1(C[C@H](NC(=O)[C@H](CC(C)C)NC(=O)[C@@H](NC(=O)[C@H](CO)NC(=O)OC(C)(C)C)C(C)C)\C=C\C(=O)OCC)CCNC1=O
InChI Key InChIKey=JQGRQEJSWFZWOD-IDAOPYDCSA-N
Data  2 IC50
  Tab Delimited (TSV)   2D SDfile   Computed 3D by Vconf -m prep SDfile
Find this compound or compounds like it in BindingDB:
Activity Spreadsheet -- Enzyme Inhibition Constant Data from BindingDB
Found 2 hits for monomerid = 50477129
TargetReplicase polyprotein 1ab(Human SARS coronavirus (SARS-CoV) (Severe acute re...)
Michigan State University
LigandPNGBDBM50477129(CHEMBL397154 | acs.jmedchem.1c00409_ST.512)
Affinity DataIC50:  1.00E+4nM. Assay description: This is a review article. Please point to the original journal.
Ligand InfoPC cidPC sid
In DepthDetails ArticlePubMed
TargetReplicase polyprotein 1ab(Human SARS coronavirus (SARS-CoV) (Severe acute re...)
Michigan State University
LigandPNGBDBM50477129(CHEMBL397154 | acs.jmedchem.1c00409_ST.512)
Affinity DataIC50:  1.00E+4nM. Assay description: Inhibition of SARS-CoV 3C-like protease by FRET based microplate assay
Ligand InfoPC cidPC sid
In DepthDetails ArticlePubMed