BDBM50482287 CHEMBL1170491
SMILES CC(=O)N1CCC(CC1)C(=O)N1CCC(CC1)N1CCN(CC1)C(=O)c1cc(nc(c1)-c1ccc2n(C)c(C)c(C)c2c1)-c1ccccc1
InChI Key InChIKey=GNIRGEIMVRMPCV-UHFFFAOYSA-N
Data  1 IC50
  Tab Delimited (TSV)   2D SDfile   Computed 3D by Vconf -m prep SDfile
Find this compound or compounds like it in BindingDB:
Activity Spreadsheet -- Enzyme Inhibition Constant Data from BindingDB
Found 1 hit for monomerid = 50482287
TargetAcetyl-CoA carboxylase 1/2(Homo sapiens (Human))
Taisho Pharmaceutical
Curated by ChEMBL
LigandPNGBDBM50482287(CHEMBL1170491)
Affinity DataIC50:  105nM. Assay description: Inhibition of human ACC1/2-mediated malonyl-CoA synthesis
Ligand InfoPC cidPC sid
In DepthDetails ArticlePubMed