BDBM50483062 CHEMBL1277135
SMILES OC(=O)c1ccc(\C=C2/C(=O)N(N=C2c2ccccc2)c2cccc(Cl)c2)cc1
InChI Key InChIKey=WZNUTIQLBDPXDT-MOSHPQCFSA-N
Data  2 IC50
  Tab Delimited (TSV)   2D SDfile   Computed 3D by Vconf -m prep SDfile
Find this compound or compounds like it in BindingDB:
Activity Spreadsheet -- Enzyme Inhibition Constant Data from BindingDB
Found 2 hits for monomerid = 50483062
TargetGenome polyprotein(Coxsackievirus B3 (strain Nancy))
Academia Sinica
Curated by ChEMBL
LigandPNGBDBM50483062(CHEMBL1277135)
Affinity DataIC50:  1.73E+4nM. Assay description: Inhibition of coxsackievirus B3 3C protease by fluorescence plate reader analysis
Ligand InfoPC cidPC sid
In DepthDetails ArticlePubMed
TargetReplicase polyprotein 1ab(Human SARS coronavirus (SARS-CoV) (Severe acute re...)
Academia Sinica
Curated by ChEMBL
LigandPNGBDBM50483062(CHEMBL1277135)
Affinity DataIC50:  1.08E+4nM. Assay description: Inhibition of SARS coronavirus 3C-like protease by fluorescence plate reader analysis
Ligand InfoPC cidPC sid
In DepthDetails ArticlePubMed