BDBM50483172 CHEMBL1632158
SMILES COC(=O)CCCCCN1CCC(CNC(=O)c2c3OCCCn3c3ccccc23)CC1
InChI Key InChIKey=RNXYMZNGMNWKMC-UHFFFAOYSA-N
Data  41 KI
  Tab Delimited (TSV)   2D SDfile   Computed 3D by Vconf -m prep SDfile
Find this compound or compounds like it in BindingDB:
Activity Spreadsheet -- Enzyme Inhibition Constant Data from BindingDB
Found 41 hits for monomerid = 50483172
Target5-hydroxytryptamine receptor 4(Homo sapiens (Human))
Drug Discovery Laboratory
Curated by ChEMBL
LigandPNGBDBM50483172(CHEMBL1632158)
Affinity DataKi:  0.107nM. Assay description: Displacement of [3H]GR113808 from human 5HT4 receptor expressed in HEK293 cells by liquid scintillation counting
Ligand InfoPC cidPC sid
In DepthDetails ArticlePubMed
Target5-hydroxytryptamine receptor 2B(Homo sapiens (Human))
Drug Discovery Laboratory
Curated by ChEMBL
LigandPNGBDBM50483172(CHEMBL1632158)
Affinity DataKi:  316nM. Assay description: Binding affinity to 5HT2B receptor
Ligand InfoPC cidPC sid
In DepthDetails ArticlePubMed
TargetSigma non-opioid intracellular receptor 1(Homo sapiens (Human))
Drug Discovery Laboratory
Curated by ChEMBL
LigandPNGBDBM50483172(CHEMBL1632158)
Affinity DataKi:  398nM. Assay description: Binding affinity to opioid receptor Sigma1
Ligand InfoPC cidPC sid
In DepthDetails ArticlePubMed
TargetAlpha-2B adrenergic receptor(Homo sapiens (Human))
Drug Discovery Laboratory
Curated by ChEMBL
LigandPNGBDBM50483172(CHEMBL1632158)
Affinity DataKi:  1.26E+3nM. Assay description: Binding affinity to alpha2B adrenergic receptor
Ligand InfoPC cidPC sid
In DepthDetails ArticlePubMed
TargetHistamine H1 receptor(Homo sapiens (Human))
Drug Discovery Laboratory
Curated by ChEMBL
LigandPNGBDBM50483172(CHEMBL1632158)
Affinity DataKi:  1.26E+3nM. Assay description: Binding affinity to Histamine receptor H1
Ligand InfoPC cidPC sid
In DepthDetails ArticlePubMed
TargetMuscarinic acetylcholine receptor M2(Homo sapiens (Human))
Drug Discovery Laboratory
Curated by ChEMBL
LigandPNGBDBM50483172(CHEMBL1632158)
Affinity DataKi:  2.51E+3nM. Assay description: Binding affinity to muscarinic acetylcholine receptor M2
Ligand InfoPC cidPC sid
In DepthDetails ArticlePubMed
Target5-hydroxytryptamine receptor 3A(Homo sapiens (Human))
Drug Discovery Laboratory
Curated by ChEMBL
LigandPNGBDBM50483172(CHEMBL1632158)
Affinity DataKi:  2.51E+3nM. Assay description: Binding affinity to 5HT3 receptor
Ligand InfoPC cidPC sid
In DepthDetails ArticlePubMed
Target5-hydroxytryptamine receptor 1D(Homo sapiens (Human))
Drug Discovery Laboratory
Curated by ChEMBL
LigandPNGBDBM50483172(CHEMBL1632158)
Affinity DataKi:  3.16E+3nM. Assay description: Binding affinity to 5HT1D receptor
Ligand InfoPC cidPC sid
In DepthDetails ArticlePubMed
TargetHistamine H2 receptor(Homo sapiens (Human))
Drug Discovery Laboratory
Curated by ChEMBL
LigandPNGBDBM50483172(CHEMBL1632158)
Affinity DataKi:  3.16E+3nM. Assay description: Binding affinity to Histamine receptor H2
Ligand InfoPC cidPC sid
In DepthDetails ArticlePubMed
Target5-hydroxytryptamine receptor 2A(Homo sapiens (Human))
Drug Discovery Laboratory
Curated by ChEMBL
LigandPNGBDBM50483172(CHEMBL1632158)
Affinity DataKi:  6.31E+3nM. Assay description: Binding affinity to 5HT2A receptor
Ligand InfoPC cidPC sid
In DepthDetails ArticlePubMed
TargetBeta-3 adrenergic receptor(Homo sapiens (Human))
Drug Discovery Laboratory
Curated by ChEMBL
LigandPNGBDBM50483172(CHEMBL1632158)
Affinity DataKi: <1.00E+4nM. Assay description: Binding affinity to beta3 adrenergic receptor
Ligand InfoPC cidPC sid
In DepthDetails ArticlePubMed
TargetD(3) dopamine receptor(Homo sapiens (Human))
Drug Discovery Laboratory
Curated by ChEMBL
LigandPNGBDBM50483172(CHEMBL1632158)
Affinity DataKi: <1.00E+4nM. Assay description: Binding affinity to dopamine receptor D3
Ligand InfoPC cidPC sid
In DepthDetails ArticlePubMed
TargetHistamine H3 receptor(Homo sapiens (Human))
Drug Discovery Laboratory
Curated by ChEMBL
LigandPNGBDBM50483172(CHEMBL1632158)
Affinity DataKi: <1.00E+4nM. Assay description: Binding affinity to Histamine receptor H3
Ligand InfoPC cidPC sid
In DepthDetails ArticlePubMed
TargetMuscarinic acetylcholine receptor M5(Homo sapiens (Human))
Drug Discovery Laboratory
Curated by ChEMBL
LigandPNGBDBM50483172(CHEMBL1632158)
Affinity DataKi: <1.00E+4nM. Assay description: Binding affinity to muscarinic acetylcholine receptor M5
Ligand InfoPC cidPC sid
In DepthDetails ArticlePubMed
TargetD(1A) dopamine receptor(Homo sapiens (Human))
Drug Discovery Laboratory
Curated by ChEMBL
LigandPNGBDBM50483172(CHEMBL1632158)
Affinity DataKi: <1.00E+4nM. Assay description: Binding affinity to dopamine receptor D1
Ligand InfoPC cidPC sid
In DepthDetails ArticlePubMed
TargetHistamine H4 receptor(Homo sapiens (Human))
Drug Discovery Laboratory
Curated by ChEMBL
LigandPNGBDBM50483172(CHEMBL1632158)
Affinity DataKi: <1.00E+4nM. Assay description: Binding affinity to Histamine receptor H4
Ligand InfoPC cidPC sid
In DepthDetails ArticlePubMed
TargetMuscarinic acetylcholine receptor M4(Homo sapiens (Human))
Drug Discovery Laboratory
Curated by ChEMBL
LigandPNGBDBM50483172(CHEMBL1632158)
Affinity DataKi: <1.00E+4nM. Assay description: Binding affinity to muscarinic acetylcholine receptor M4
Ligand InfoPC cidPC sid
In DepthDetails ArticlePubMed
Target5-hydroxytryptamine receptor 1B(Homo sapiens (Human))
Drug Discovery Laboratory
Curated by ChEMBL
LigandPNGBDBM50483172(CHEMBL1632158)
Affinity DataKi: <1.00E+4nM. Assay description: Binding affinity to 5HT1B receptor
Ligand InfoPC cidPC sid
In DepthDetails ArticlePubMed
TargetD(1B) dopamine receptor(Homo sapiens (Human))
Drug Discovery Laboratory
Curated by ChEMBL
LigandPNGBDBM50483172(CHEMBL1632158)
Affinity DataKi: <1.00E+4nM. Assay description: Binding affinity to dopamine receptor D5
Ligand InfoPC cidPC sid
In DepthDetails ArticlePubMed
TargetBeta-2 adrenergic receptor(Homo sapiens (Human))
Drug Discovery Laboratory
Curated by ChEMBL
LigandPNGBDBM50483172(CHEMBL1632158)
Affinity DataKi: <1.00E+4nM. Assay description: Binding affinity to beta2 adrenergic receptor
Ligand InfoPC cidPC sid
In DepthDetails ArticlePubMed
TargetD(4) dopamine receptor(Homo sapiens (Human))
Drug Discovery Laboratory
Curated by ChEMBL
LigandPNGBDBM50483172(CHEMBL1632158)
Affinity DataKi: <1.00E+4nM. Assay description: Binding affinity to dopamine receptor D4
Ligand InfoPC cidPC sid
In DepthDetails ArticlePubMed
Target5-hydroxytryptamine receptor 5A(Homo sapiens (Human))
Drug Discovery Laboratory
Curated by ChEMBL
LigandPNGBDBM50483172(CHEMBL1632158)
Affinity DataKi: <1.00E+4nM. Assay description: Binding affinity to 5HT5A receptor
Ligand InfoPC cidPC sid
In DepthDetails ArticlePubMed
TargetAlpha-1B adrenergic receptor(Homo sapiens (Human))
Drug Discovery Laboratory
Curated by ChEMBL
LigandPNGBDBM50483172(CHEMBL1632158)
Affinity DataKi: <1.00E+4nM. Assay description: Binding affinity to Alpha-1B adrenergic receptor
Ligand InfoPC cidPC sid
In DepthDetails ArticlePubMed
TargetAlpha-2A adrenergic receptor(Homo sapiens (Human))
Drug Discovery Laboratory
Curated by ChEMBL
LigandPNGBDBM50483172(CHEMBL1632158)
Affinity DataKi: <1.00E+4nM. Assay description: Binding affinity to alpha2A adrenergic receptor
Ligand InfoPC cidPC sid
In DepthDetails ArticlePubMed
TargetD(2) dopamine receptor(Homo sapiens (Human))
Drug Discovery Laboratory
Curated by ChEMBL
LigandPNGBDBM50483172(CHEMBL1632158)
Affinity DataKi: <1.00E+4nM. Assay description: Binding affinity to dopamine receptor D2
Ligand InfoPC cidPC sid
In DepthDetails ArticlePubMed
TargetMuscarinic acetylcholine receptor M1(Homo sapiens (Human))
Drug Discovery Laboratory
Curated by ChEMBL
LigandPNGBDBM50483172(CHEMBL1632158)
Affinity DataKi: <1.00E+4nM. Assay description: Binding affinity to muscarinic acetylcholine receptor M1
Ligand InfoPC cidPC sid
In DepthDetails ArticlePubMed
TargetMu-type opioid receptor(Homo sapiens (Human))
Drug Discovery Laboratory
Curated by ChEMBL
LigandPNGBDBM50483172(CHEMBL1632158)
Affinity DataKi: <1.00E+4nM. Assay description: Binding affinity to opioid receptor MOR
Ligand InfoPC cidPC sid
In DepthDetails ArticlePubMed
Target5-hydroxytryptamine receptor 6(Homo sapiens (Human))
Drug Discovery Laboratory
Curated by ChEMBL
LigandPNGBDBM50483172(CHEMBL1632158)
Affinity DataKi: <1.00E+4nM. Assay description: Binding affinity to 5HT6 receptor
Ligand InfoPC cidPC sid
In DepthDetails ArticlePubMed
TargetSodium-dependent serotonin transporter(Homo sapiens (Human))
Drug Discovery Laboratory
Curated by ChEMBL
LigandPNGBDBM50483172(CHEMBL1632158)
Affinity DataKi: <1.00E+4nM. Assay description: Binding affinity to SERT
Ligand InfoPC cidPC sid
In DepthDetails ArticlePubMed
TargetKappa-type opioid receptor(Homo sapiens (Human))
Drug Discovery Laboratory
Curated by ChEMBL
LigandPNGBDBM50483172(CHEMBL1632158)
Affinity DataKi: <1.00E+4nM. Assay description: Binding affinity to opioid receptor KOR
Ligand InfoPC cidPC sid
In DepthDetails ArticlePubMed
TargetAlpha-2C adrenergic receptor(Homo sapiens (Human))
Drug Discovery Laboratory
Curated by ChEMBL
LigandPNGBDBM50483172(CHEMBL1632158)
Affinity DataKi: <1.00E+4nM. Assay description: Binding affinity to Alpha-2C adrenergic receptor
Ligand InfoPC cidPC sid
In DepthDetails ArticlePubMed
Target5-hydroxytryptamine receptor 7(Homo sapiens (Human))
Drug Discovery Laboratory
Curated by ChEMBL
LigandPNGBDBM50483172(CHEMBL1632158)
Affinity DataKi: <1.00E+4nM. Assay description: Binding affinity to 5HT7 receptor
Ligand InfoPC cidPC sid
In DepthDetails ArticlePubMed
TargetSodium-dependent dopamine transporter(Homo sapiens (Human))
Drug Discovery Laboratory
Curated by ChEMBL
LigandPNGBDBM50483172(CHEMBL1632158)
Affinity DataKi: <1.00E+4nM. Assay description: Binding affinity to DAT
Ligand InfoPC cidPC sid
In DepthDetails ArticlePubMed
TargetDelta-type opioid receptor(Homo sapiens (Human))
Drug Discovery Laboratory
Curated by ChEMBL
LigandPNGBDBM50483172(CHEMBL1632158)
Affinity DataKi: <1.00E+4nM. Assay description: Binding affinity to opioid receptor DOR
Ligand InfoPC cidPC sid
In DepthDetails ArticlePubMed
TargetMuscarinic acetylcholine receptor M3(Homo sapiens (Human))
Drug Discovery Laboratory
Curated by ChEMBL
LigandPNGBDBM50483172(CHEMBL1632158)
Affinity DataKi: <1.00E+4nM. Assay description: Binding affinity to muscarinic acetylcholine receptor M3
Ligand InfoPC cidPC sid
In DepthDetails ArticlePubMed
TargetBeta-1 adrenergic receptor(Homo sapiens (Human))
Drug Discovery Laboratory
Curated by ChEMBL
LigandPNGBDBM50483172(CHEMBL1632158)
Affinity DataKi: <1.00E+4nM. Assay description: Binding affinity to beta1 adrenergic receptor
Ligand InfoPC cidPC sid
In DepthDetails ArticlePubMed
TargetAlpha-1A adrenergic receptor(Homo sapiens (Human))
Drug Discovery Laboratory
Curated by ChEMBL
LigandPNGBDBM50483172(CHEMBL1632158)
Affinity DataKi: <1.00E+4nM. Assay description: Binding affinity to alpha1A adrenergic receptor
Ligand InfoPC cidPC sid
In DepthDetails ArticlePubMed
Target5-hydroxytryptamine receptor 2C(Homo sapiens (Human))
Drug Discovery Laboratory
Curated by ChEMBL
LigandPNGBDBM50483172(CHEMBL1632158)
Affinity DataKi: <1.00E+4nM. Assay description: Binding affinity to 5HT2C receptor
Ligand InfoPC cidPC sid
In DepthDetails ArticlePubMed
Target5-hydroxytryptamine receptor 1E(Homo sapiens (Human))
Drug Discovery Laboratory
Curated by ChEMBL
LigandPNGBDBM50483172(CHEMBL1632158)
Affinity DataKi: <1.00E+4nM. Assay description: Binding affinity to 5HT1E receptor
Ligand InfoPC cidPC sid
In DepthDetails ArticlePubMed
TargetAlpha-1D adrenergic receptor(Homo sapiens (Human))
Drug Discovery Laboratory
Curated by ChEMBL
LigandPNGBDBM50483172(CHEMBL1632158)
Affinity DataKi: <1.00E+4nM. Assay description: Binding affinity to Alpha-1D adrenergic receptor
Ligand InfoPC cidPC sid
In DepthDetails ArticlePubMed
Target5-hydroxytryptamine receptor 1A(Homo sapiens (Human))
Drug Discovery Laboratory
Curated by ChEMBL
LigandPNGBDBM50483172(CHEMBL1632158)
Affinity DataKi: <1.00E+4nM. Assay description: Binding affinity to 5HT1A receptor
Ligand InfoPC cidPC sid
In DepthDetails ArticlePubMed