BDBM50486242 CHEMBL2230130
SMILES S(Sc1ccccc1)c1nc[nH]n1
InChI Key InChIKey=KKOWQHRUIWUIQU-UHFFFAOYSA-N
Data  2 KI
  Tab Delimited (TSV)   2D SDfile   Computed 3D by Vconf -m prep SDfile
Find this compound or compounds like it in BindingDB:
Activity Spreadsheet -- Enzyme Inhibition Constant Data from BindingDB
Found 2 hits for monomerid = 50486242
TargetAcetolactate synthase, chloroplastic(Arabidopsis thaliana)
Nankai University
Curated by ChEMBL
LigandPNGBDBM50486242(CHEMBL2230130)
Affinity DataKi:  1.70E+3nM. Assay description: Inhibition of wild type Arabidopsis thaliana acetohydroxyacid synthase colorimetric assay
Ligand InfoKEGGPC cidPC sid
In DepthDetails ArticlePubMed
TargetAcetolactate synthase, chloroplastic(Arabidopsis thaliana)
Nankai University
Curated by ChEMBL
LigandPNGBDBM50486242(CHEMBL2230130)
Affinity DataKi:  2.45E+4nM. Assay description: Inhibition of Arabidopsis thaliana acetohydroxyacid synthase W574L mutant colorimetric assay
Ligand InfoKEGGPC cidPC sid
In DepthDetails ArticlePubMed