BDBM50486726 Trametenolic Acid
SMILES [H][C@@]1([#6]-[#6][C@@]2([#6])[#6]-3=[#6](-[#6]-[#6][C@]12[#6])[C@@]1([#6])[#6]-[#6]-[#6@H](-[#8])C([#6])([#6])[C@]1([H])[#6]-[#6]-3)[#6@@H](-[#6]-[#6]\[#6]=[#6](\[#6])-[#6])-[#6](-[#8])=O
InChI Key InChIKey=NBSBUIQBEPROBM-GIICLEHTSA-N
Data  1 IC50
  Tab Delimited (TSV)   2D SDfile   Computed 3D by Vconf -m prep SDfile
Find this compound or compounds like it in BindingDB:
Activity Spreadsheet -- Enzyme Inhibition Constant Data from BindingDB
Found 1 hit for monomerid = 50486726
TargetAlpha-glucosidase MAL62(Saccharomyces cerevisiae)TBA
LigandPNGBDBM50486726(Trametenolic Acid)
Affinity DataIC50:  1.71E+4nM. Assay description: Inhibition of Saccharomyces cerevisiae (baker's yeast) alpha-glucosidase using p-nitrophenyl glucopyranoside as substrate preincubated for 30 min bef...
In DepthDetails Article