BDBM50487053 CHEMBL2253240
SMILES COc1cc(OC)nc(Oc2cccc3c(C)nn(Cc4ccc(Br)cc4F)c(=O)c23)n1
InChI Key InChIKey=JIDAPYSOXVGKRW-UHFFFAOYSA-N
Data  1 KI
  Tab Delimited (TSV)   2D SDfile   Computed 3D by Vconf -m prep SDfile
Find this compound or compounds like it in BindingDB:
Activity Spreadsheet -- Enzyme Inhibition Constant Data from BindingDB
Found 1 hit for monomerid = 50487053
TargetAcetolactate synthase, chloroplastic(Arabidopsis thaliana)
Central China Normal University
Curated by ChEMBL
LigandPNGBDBM50487053(CHEMBL2253240)
Affinity DataKi:  4.20E+5nM. Assay description: Inhibition of wild type Arabidopsis thaliana acetohydroxyacid synthase
Ligand InfoPC cidPC sid
In DepthDetails ArticlePubMed