BDBM50488590 CHEMBL526942::TCMDC-125235
SMILES COc1ccc(-c2onc(c2-c2ccc(Br)cc2)C(F)(F)F)c(O)c1
InChI Key InChIKey=GEOWWQMPJGSRCF-UHFFFAOYSA-N
Data  1 IC50
  Tab Delimited (TSV)   2D SDfile   Computed 3D by Vconf -m prep SDfile
Find this compound or compounds like it in BindingDB:
Activity Spreadsheet -- Enzyme Inhibition Constant Data from BindingDB
Found 1 hit for monomerid = 50488590
Target1-deoxy-D-xylulose-5-phosphate synthase, chloroplastic(Arabidopsis thaliana)
Basf-Se
Curated by ChEMBL
LigandPNGBDBM50488590(CHEMBL526942 | TCMDC-125235)
Affinity DataIC50:  3.20E+4nM. Assay description: Inhibition of Arabidopsis thaliana N-terminal GST-tagged DXS expressed in Escherichia coli BL21 GOLD (DE) using glyceraldehydephosphate and pyruvate ...
In DepthDetails ArticlePubMed