BDBM50489171 CHEMBL2316337::acs.jmedchem.1c00409_ST.364
SMILES CC(C)C[C@H](NC(=O)[C@@H](NC(=O)[C@H](C)NC(=O)OCc1ccccc1)C(C)C)C(=O)N[C@@H](CCC(N)=O)C#N
InChI Key InChIKey=FIKWFNMSLXSBKM-ROQCDXFCSA-N
Data  3 IC50
  Tab Delimited (TSV)   2D SDfile   Computed 3D by Vconf -m prep SDfile
Find this compound or compounds like it in BindingDB:
Activity Spreadsheet -- Enzyme Inhibition Constant Data from BindingDB
Found 4 hits for monomerid = 50489171
TargetReplicase polyprotein 1ab(Human SARS coronavirus (SARS-CoV) (Severe acute re...)
The Chinese University Of Hong Kong
Curated by ChEMBL
LigandPNGBDBM50489171(CHEMBL2316337 | acs.jmedchem.1c00409_ST.364)
Affinity DataIC50:  4.60E+3nM. Assay description: Inhibition of SARS coronavirus 3C-like protease pretreated for 5 mins before substrate addition by fluorimetry
Ligand InfoPC cidPC sid
In DepthDetails ArticlePubMed
TargetReplicase polyprotein 1ab(2019-nCoV)
University Of Alberta Edmonton
Curated by ChEMBL
LigandPNGBDBM50489171(CHEMBL2316337 | acs.jmedchem.1c00409_ST.364)
Affinity DataIC50:  4.60E+3nM. Assay description: Inhibition of SARS-CoV-2 3CL protease by FRET assay
Ligand InfoPC cidPC sid
In DepthDetails PubMed
TargetReplicase polyprotein 1ab(Human SARS coronavirus (SARS-CoV) (Severe acute re...)
The Chinese University Of Hong Kong
Curated by ChEMBL
LigandPNGBDBM50489171(CHEMBL2316337 | acs.jmedchem.1c00409_ST.364)
Affinity DataIC50:  4.60E+3nM. Assay description: This is a review article. Please point to the original journal.
Ligand InfoPC cidPC sid
In DepthDetails ArticlePubMed
TargetReplicase polyprotein 1ab(2019-nCoV)
University Of Alberta Edmonton
Curated by ChEMBL
LigandPNGBDBM50489171(CHEMBL2316337 | acs.jmedchem.1c00409_ST.364)
Affinity Data. Assay description: This is a review article. Please point to the original journal.
Ligand InfoPC cidPC sid
In DepthDetails ArticlePubMed