BDBM50497018 CHEMBL3235589
SMILES CCCCCCCCCCCC(=O)C1=C(O)COC1=O
InChI Key InChIKey=BJOHTZSKIZOSFS-UHFFFAOYSA-N
Data  1 Kd
  Tab Delimited (TSV)   2D SDfile   Computed 3D by Vconf -m prep SDfile
Find this compound or compounds like it in BindingDB:
Activity Spreadsheet -- Enzyme Inhibition Constant Data from BindingDB
Found 1 hit for monomerid = 50497018
TargetSensory histidine kinase DcuS(Staphylococcus aureus)
University Of Nottingham
Curated by ChEMBL
LigandPNGBDBM50497018(CHEMBL3235589)
Affinity DataKd:  7.20E+4nM. Assay description: Binding affinity to AgrC in Staphylococcus aureus assessed as disruption of membrane dipole potential by di-8-ANEPPS fluorescence assay
Ligand InfoPC cidPC sid
In DepthDetails ArticlePubMed