BDBM50497022 CHEMBL1213657
SMILES CCCCCCCCC\C(O)=C1\C(=O)N[C@@H](CCO)C1=O
InChI Key InChIKey=OSWGMRUTKTWVOY-JOLOJFPGSA-N
Data  1 Kd
  Tab Delimited (TSV)   2D SDfile   Computed 3D by Vconf -m prep SDfile
Find this compound or compounds like it in BindingDB:
Activity Spreadsheet -- Enzyme Inhibition Constant Data from BindingDB
Found 1 hit for monomerid = 50497022
TargetSensory histidine kinase DcuS(Staphylococcus aureus)
University Of Nottingham
Curated by ChEMBL
LigandPNGBDBM50497022(CHEMBL1213657)
Affinity DataKd:  2.22E+5nM. Assay description: Binding affinity to AgrC in Staphylococcus aureus assessed as disruption of membrane dipole potential by di-8-ANEPPS fluorescence assay
Ligand InfoPC cidPC sid
In DepthDetails ArticlePubMed