BDBM50500119 CHEMBL3745807
SMILES [H][C@]12C[C@]1([C@@H](O)[C@@H](O)[C@@H]2n1cnc2c(NC)nc(nc12)-n1cc(nn1)-c1cnn(C)c1)C(=O)NC
InChI Key InChIKey=OUYJFFRTPCMVDB-QKZATRHHSA-N
Data  1 KI
  Tab Delimited (TSV)   2D SDfile   Computed 3D by Vconf -m prep SDfile
Find this compound or compounds like it in BindingDB:
Activity Spreadsheet -- Enzyme Inhibition Constant Data from BindingDB
Found 1 hit for monomerid = 50500119
TargetTransmembrane domain-containing protein TMIGD3(Homo sapiens (Human))
National Institute Of Diabetes And Digestive And Kidney Diseases
Curated by ChEMBL
LigandPNGBDBM50500119(CHEMBL3745807)
Affinity DataKi:  2.20nM. Assay description: Displacement of [125I]N6-(4-amino-3-iodobenzyl)adenosine-5'-N-methyl-uronamide from human adenosine A3 receptor stably expressed in CHO cell membrane...
Ligand InfoPC cidPC sid
In DepthDetails ArticlePubMed