BDBM50500351 CHEMBL3746960::US11066363, Compound 19
SMILES CCc1cc2C(=O)c3c([nH]c4cc(ccc34)C#N)C(C)(C)c2cc1N1CCN(C)CC1
InChI Key InChIKey=VYUPBBUIPPRDHY-UHFFFAOYSA-N
Data  3 IC50
  Tab Delimited (TSV)   2D SDfile   Computed 3D by Vconf -m prep SDfile
Find this compound or compounds like it in BindingDB:
Activity Spreadsheet -- Enzyme Inhibition Constant Data from BindingDB
Found 3 hits for monomerid = 50500351
TargetALK tyrosine kinase receptor/Echinoderm microtubule-associated protein-like 4(Homo sapiens (Human))
Dana-Farber Cancer Institute
Curated by ChEMBL
LigandPNGBDBM50500351(CHEMBL3746960 | US11066363, Compound 19)
Affinity DataIC50:  2nM. Assay description: Inhibition of wild type EML4-ALK (unknown origin) expressed in mouse Ba/F3 cells assessed as cell viability after 72 hrs by MTS assay
Ligand InfoPC cidPC sid
In DepthDetails ArticlePubMed
TargetSRSF protein kinase 2(Homo sapiens (Human))
Dana-Farber Cancer Institute
US Patent
LigandPNGBDBM50500351(CHEMBL3746960 | US11066363, Compound 19)
Affinity DataIC50:  8.57nM. Assay description: SRPK1 Inhibitory Activities of the Compounds.
Ligand InfoPC cidPC sid
In DepthDetails US Patent
TargetSRSF protein kinase 1(Homo sapiens (Human))
Dana-Farber Cancer Institute
US Patent
LigandPNGBDBM50500351(CHEMBL3746960 | US11066363, Compound 19)
Affinity DataIC50:  2.66nM. Assay description: SRPK1 Inhibitory Activities of the Compounds.
Ligand InfoPC cidPC sid
In DepthDetails US Patent