BDBM50502231 CHEMBL4449167
SMILES Clc1ccc(cc1)C(Nc1ccc(NC(c2ccc(Cl)cc2)n2nc(oc2=S)-c2cc3ccccc3oc2=O)cc1)n1nc(oc1=S)-c1cc(=O)oc2ccccc12
InChI Key InChIKey=BQXPUDCETZOLFA-UHFFFAOYSA-N
Data  1 IC50
  Tab Delimited (TSV)   2D SDfile   Computed 3D by Vconf -m prep SDfile
Find this compound or compounds like it in BindingDB:
Activity Spreadsheet -- Enzyme Inhibition Constant Data from BindingDB
Found 1 hit for monomerid = 50502231
TargetProbable maltase-glucoamylase 2(Homo sapiens)
Babasaheb Bhimrao Ambedkar University (A Central University)
Curated by ChEMBL
LigandPNGBDBM50502231(CHEMBL4449167)
Affinity DataIC50:  70nM. Assay description: Inhibition of alpha-glucosidase (unknown origin) using p-nitro phenyl glucopyranoside as substrate preincubated for 5 mins followed by substrate addi...
Ligand InfoPC cidPC sid
In DepthDetails ArticlePubMed