BDBM50503048 CHEMBL4457754
SMILES [H][C@@]12CCN[C@]1(C)CN(c1ccccc1)c1ccccc21
InChI Key InChIKey=OHCPINQLTJGNRS-FUHWJXTLSA-N
Data  39 KI
  Tab Delimited (TSV)   2D SDfile   Computed 3D by Vconf -m prep SDfile
Find this compound or compounds like it in BindingDB:
Activity Spreadsheet -- Enzyme Inhibition Constant Data from BindingDB
Found 39 hits for monomerid = 50503048
Target5-hydroxytryptamine receptor 7(Homo sapiens (Human))
University Of Minnesota Twin Cities
Curated by ChEMBL
LigandPNGBDBM50503048(CHEMBL4457754)
Affinity DataKi:  6.30nM. Assay description: Displacement of [3H]-LSD from human recombinant 5-HT7 receptor expressed in stable HEK cells after 90 mins by microbeta scintillation counting method
Ligand InfoPC cidPC sid
In DepthDetails ArticlePubMed
Target5-hydroxytryptamine receptor 7(Homo sapiens (Human))
University Of Minnesota Twin Cities
Curated by ChEMBL
LigandPNGBDBM50503048(CHEMBL4457754)
Affinity DataKi:  6.30nM. Assay description: Displacement of [3H]-LSD from human recombinant 5-HT7 receptor expressed in stable HEK cells after 90 mins by microbeta scintillation counting method
Ligand InfoPC cidPC sid
In DepthDetails ArticlePubMed
Target5-hydroxytryptamine receptor 2B(Homo sapiens (Human))
University Of Minnesota Twin Cities
Curated by ChEMBL
LigandPNGBDBM50503048(CHEMBL4457754)
Affinity DataKi:  501nM. Assay description: Displacement of [3H]-LSD from human recombinant 5-HT2B receptor stably expressed in HEK cells after 90 mins by microbeta scintillation counting metho...
Ligand InfoPC cidPC sid
In DepthDetails ArticlePubMed
TargetSigma non-opioid intracellular receptor 1(Homo sapiens (Human))
University Of Minnesota Twin Cities
Curated by ChEMBL
LigandPNGBDBM50503048(CHEMBL4457754)
Affinity DataKi:  501nM. Assay description: Displacement of [3H]-Pentazocine from human recombinant sigma1 receptor expressed in HEKT cells after 90 mins by microbeta scintillation counting met...
Ligand InfoPC cidPC sid
In DepthDetails ArticlePubMed
TargetSigma intracellular receptor 2(Homo sapiens (Human))
University Of Minnesota Twin Cities
Curated by ChEMBL
LigandPNGBDBM50503048(CHEMBL4457754)
Affinity DataKi:  1.00E+3nM. Assay description: Displacement of [3H]-Pentazocine from human recombinant sigma2 receptor expressed in HEKT cells after 90 mins by microbeta scintillation counting met...
Ligand InfoPC cidPC sid
In DepthDetails ArticlePubMed
TargetAlpha-1D adrenergic receptor(Homo sapiens (Human))
University Of Minnesota Twin Cities
Curated by ChEMBL
LigandPNGBDBM50503048(CHEMBL4457754)
Affinity DataKi:  1.00E+3nM. Assay description: Displacement of [3H]-Prazosin from human recombinant adrenergic Alpha1D receptor expressed in cells after 90 mins by microbeta scintillation counting...
Ligand InfoPC cidPC sid
In DepthDetails ArticlePubMed
TargetAlpha-2C adrenergic receptor(Homo sapiens (Human))
University Of Minnesota Twin Cities
Curated by ChEMBL
LigandPNGBDBM50503048(CHEMBL4457754)
Affinity DataKi:  1.00E+3nM. Assay description: Displacement of [3H]-Rauwolscine from human recombinant adrenergic Alpha2C receptor expressed in stable MDCK cells after 90 mins by microbeta scintil...
Ligand InfoPC cidPC sid
In DepthDetails ArticlePubMed
TargetSodium-dependent noradrenaline transporter(Homo sapiens (Human))
University Of Minnesota Twin Cities
Curated by ChEMBL
LigandPNGBDBM50503048(CHEMBL4457754)
Affinity DataKi:  1.59E+3nM. Assay description: Displacement of [3H]-Nisoxetine from human recombinant NET receptor expressed in stable HEK cells after 90 mins by microbeta scintillation counting m...
Ligand InfoPC cidPC sid
In DepthDetails ArticlePubMed
TargetHistamine H2 receptor(Homo sapiens (Human))
University Of Minnesota Twin Cities
Curated by ChEMBL
LigandPNGBDBM50503048(CHEMBL4457754)
Affinity DataKi:  2.00E+3nM. Assay description: Displacement of [125I]-Iodoaminopotentidine from human recombinant histamine H2 receptor expressed in stable HEK cells after 90 mins by microbeta sci...
Ligand InfoPC cidPC sid
In DepthDetails ArticlePubMed
TargetBeta-1 adrenergic receptor(Homo sapiens (Human))
University Of Minnesota Twin Cities
Curated by ChEMBL
LigandPNGBDBM50503048(CHEMBL4457754)
Affinity DataKi:  3.16E+3nM. Assay description: Displacement of [125I]-pindolol from human recombinant adrenergic Beta1 receptor expressed in Flp-In CHO cells after 90 mins by microbeta scintillati...
Ligand InfoPC cidPC sid
In DepthDetails ArticlePubMed
TargetMuscarinic acetylcholine receptor M2(Homo sapiens (Human))
University Of Minnesota Twin Cities
Curated by ChEMBL
LigandPNGBDBM50503048(CHEMBL4457754)
Affinity DataKi: <1.00E+4nM. Assay description: Displacement of [3H]-QNB/[3H]-NMS from human recombinant Muscarinic acetylcholine M2 receptor expressed in stable CHO cells after 90 mins by microbet...
Ligand InfoPC cidPC sid
In DepthDetails ArticlePubMed
TargetMuscarinic acetylcholine receptor M3(Homo sapiens (Human))
University Of Minnesota Twin Cities
Curated by ChEMBL
LigandPNGBDBM50503048(CHEMBL4457754)
Affinity DataKi: <1.00E+4nM. Assay description: Displacement of [3H]-QNB/[3H]-NMS from human recombinant Muscarinic acetylcholine M3 receptor expressed in stable CHO cells after 90 mins by microbet...
Ligand InfoPC cidPC sid
In DepthDetails ArticlePubMed
TargetMuscarinic acetylcholine receptor M4(Homo sapiens (Human))
University Of Minnesota Twin Cities
Curated by ChEMBL
LigandPNGBDBM50503048(CHEMBL4457754)
Affinity DataKi: <1.00E+4nM. Assay description: Displacement of [3H]-QNB/[3H]-NMS from human recombinant Muscarinic acetylcholine M4 receptor expressed in stable CHO cells after 90 mins by microbet...
Ligand InfoPC cidPC sid
In DepthDetails ArticlePubMed
TargetKappa-type opioid receptor(Homo sapiens (Human))
University Of Minnesota Twin Cities
Curated by ChEMBL
LigandPNGBDBM50503048(CHEMBL4457754)
Affinity DataKi: <1.00E+4nM. Assay description: Displacement of [3H]-U69593 from human recombinant KOR receptor expressed in stable HEK cells after 90 mins by microbeta scintillation counting metho...
Ligand InfoPC cidPC sid
In DepthDetails ArticlePubMed
TargetSodium-dependent dopamine transporter(Homo sapiens (Human))
University Of Minnesota Twin Cities
Curated by ChEMBL
LigandPNGBDBM50503048(CHEMBL4457754)
Affinity DataKi: <1.00E+4nM. Assay description: Displacement of [3H]-Win35428 from human recombinant DAT receptor expressed in stable HEK cells after 90 mins by microbeta scintillation counting met...
Ligand InfoPC cidPC sid
In DepthDetails ArticlePubMed
TargetAlpha-1B adrenergic receptor(Homo sapiens (Human))
University Of Minnesota Twin Cities
Curated by ChEMBL
LigandPNGBDBM50503048(CHEMBL4457754)
Affinity DataKi: <1.00E+4nM. Assay description: Displacement of [3H]-Prazosin from human recombinant adrenergic Alpha1B receptor expressed in HEKT cells after 90 mins by microbeta scintillation cou...
Ligand InfoPC cidPC sid
In DepthDetails ArticlePubMed
TargetDelta-type opioid receptor(Homo sapiens (Human))
University Of Minnesota Twin Cities
Curated by ChEMBL
LigandPNGBDBM50503048(CHEMBL4457754)
Affinity DataKi: <1.00E+4nM. Assay description: Displacement of [3H]-DADLE from human recombinant DOR receptor expressed in stable HEK cells after 90 mins by microbeta scintillation counting method
Ligand InfoPC cidPC sid
In DepthDetails ArticlePubMed
TargetMuscarinic acetylcholine receptor M5(Homo sapiens (Human))
University Of Minnesota Twin Cities
Curated by ChEMBL
LigandPNGBDBM50503048(CHEMBL4457754)
Affinity DataKi: <1.00E+4nM. Assay description: Displacement of [3H]-QNB/[3H]-NMS from human recombinant Muscarinic acetylcholine M5 receptor expressed in stable CHO cells after 90 mins by microbet...
Ligand InfoPC cidPC sid
In DepthDetails ArticlePubMed
TargetD(3) dopamine receptor(Homo sapiens (Human))
University Of Minnesota Twin Cities
Curated by ChEMBL
LigandPNGBDBM50503048(CHEMBL4457754)
Affinity DataKi: <1.00E+4nM. Assay description: Displacement of [3H]-N-methylspiperone from human recombinant dopamine D3 receptor expressed in HEKT cells after 90 mins by microbeta scintillation c...
Ligand InfoPC cidPC sid
In DepthDetails ArticlePubMed
Target5-hydroxytryptamine receptor 2C(Homo sapiens (Human))
University Of Minnesota Twin Cities
Curated by ChEMBL
LigandPNGBDBM50503048(CHEMBL4457754)
Affinity DataKi: <1.00E+4nM. Assay description: Displacement of [3H]-Mesulergine from human recombinant 5-HT2C receptor expressed in HEKT cells after 90 mins by microbeta scintillation counting met...
Ligand InfoPC cidPC sid
In DepthDetails ArticlePubMed
TargetBeta-3 adrenergic receptor(Homo sapiens (Human))
University Of Minnesota Twin Cities
Curated by ChEMBL
LigandPNGBDBM50503048(CHEMBL4457754)
Affinity DataKi: <1.00E+4nM. Assay description: Displacement of [3H]-CGP12177 from human recombinant adrenergic Beta3 receptor expressed in Flp-In HEK cells after 90 mins by microbeta scintillation...
Ligand InfoPC cidPC sid
In DepthDetails ArticlePubMed
TargetAlpha-2B adrenergic receptor(Homo sapiens (Human))
University Of Minnesota Twin Cities
Curated by ChEMBL
LigandPNGBDBM50503048(CHEMBL4457754)
Affinity DataKi: <1.00E+4nM. Assay description: Displacement of [3H]-Rauwolscine from human recombinant adrenergic Alpha2B receptor expressed in HEKT cells after 90 mins by microbeta scintillation ...
Ligand InfoPC cidPC sid
In DepthDetails ArticlePubMed
Target5-hydroxytryptamine receptor 1B(Homo sapiens (Human))
University Of Minnesota Twin Cities
Curated by ChEMBL
LigandPNGBDBM50503048(CHEMBL4457754)
Affinity DataKi: <1.00E+4nM. Assay description: Displacement of [3H]5-CT from human recombinant 5-HT1B receptor expressed in stable HEK cells after 90 mins by microbeta scintillation counting metho...
Ligand InfoPC cidPC sid
In DepthDetails ArticlePubMed
TargetHistamine H1 receptor(Homo sapiens (Human))
University Of Minnesota Twin Cities
Curated by ChEMBL
LigandPNGBDBM50503048(CHEMBL4457754)
Affinity DataKi: <1.00E+4nM. Assay description: Displacement of [3H]-Pyrilamine from human recombinant histamine H1 receptor expressed in stable HEK cells after 90 mins by microbeta scintillation c...
Ligand InfoPC cidPC sid
In DepthDetails ArticlePubMed
TargetMuscarinic acetylcholine receptor M1(Homo sapiens (Human))
University Of Minnesota Twin Cities
Curated by ChEMBL
LigandPNGBDBM50503048(CHEMBL4457754)
Affinity DataKi: <1.00E+4nM. Assay description: Displacement of [3H]-QNB/[3H]-NMS from human recombinant Muscarinic acetylcholine M1 receptor expressed in stable CHO cells after 90 mins by microbet...
Ligand InfoPC cidPC sid
In DepthDetails ArticlePubMed
TargetMu-type opioid receptor(Homo sapiens (Human))
University Of Minnesota Twin Cities
Curated by ChEMBL
LigandPNGBDBM50503048(CHEMBL4457754)
Affinity DataKi: <1.00E+4nM. Assay description: Displacement of [3H]-DAMGO from human recombinant MOR receptor expressed in stable HEK cells after 90 mins by microbeta scintillation counting method
Ligand InfoPC cidPC sid
In DepthDetails ArticlePubMed
TargetD(4) dopamine receptor(Homo sapiens (Human))
University Of Minnesota Twin Cities
Curated by ChEMBL
LigandPNGBDBM50503048(CHEMBL4457754)
Affinity DataKi: <1.00E+4nM. Assay description: Displacement of [3H]-methylspiperone from human recombinant dopamine D4 receptor expressed in Stable HEK cells after 90 mins by microbeta scintillati...
Ligand InfoPC cidPC sid
In DepthDetails ArticlePubMed
Target5-hydroxytryptamine receptor 1D(Homo sapiens (Human))
University Of Minnesota Twin Cities
Curated by ChEMBL
LigandPNGBDBM50503048(CHEMBL4457754)
Affinity DataKi: <1.00E+4nM. Assay description: Displacement of [3H]5-CT from human recombinant 5-HT1D receptor transiently expressed in HEKT cells after 90 mins by microbeta scintillation counting...
Ligand InfoPC cidPC sid
In DepthDetails ArticlePubMed
TargetHistamine H4 receptor(Homo sapiens (Human))
University Of Minnesota Twin Cities
Curated by ChEMBL
LigandPNGBDBM50503048(CHEMBL4457754)
Affinity DataKi: <1.00E+4nM. Assay description: Displacement of [3H]-Histamine from human recombinant histamine H4 receptor expressed in HEKT cells after 90 mins by microbeta scintillation counting...
Ligand InfoPC cidPC sid
In DepthDetails ArticlePubMed
Target5-hydroxytryptamine receptor 1E(Homo sapiens (Human))
University Of Minnesota Twin Cities
Curated by ChEMBL
LigandPNGBDBM50503048(CHEMBL4457754)
Affinity DataKi: <1.00E+4nM. Assay description: Displacement of [3H]-HT from human recombinant 5-HT1E receptor expressed in stable HEK cells after 90 mins by microbeta scintillation counting method
Ligand InfoPC cidPC sid
In DepthDetails ArticlePubMed
Target5-hydroxytryptamine receptor 3A(Homo sapiens (Human))
University Of Minnesota Twin Cities
Curated by ChEMBL
LigandPNGBDBM50503048(CHEMBL4457754)
Affinity DataKi: <1.00E+4nM. Assay description: Displacement of [3H]-GR65630 from human recombinant 5-HT3 receptor expressed in HEKT cells after 90 mins by microbeta scintillation counting method
Ligand InfoPC cidPC sid
In DepthDetails ArticlePubMed
Target5-hydroxytryptamine receptor 6(Homo sapiens (Human))
University Of Minnesota Twin Cities
Curated by ChEMBL
LigandPNGBDBM50503048(CHEMBL4457754)
Affinity DataKi: <1.00E+4nM. Assay description: Displacement of [3H]-LSD from human recombinant 5-HT6 receptor expressed in stable HEK cells after 90 mins by microbeta scintillation counting method
Ligand InfoPC cidPC sid
In DepthDetails ArticlePubMed
TargetAlpha-1A adrenergic receptor(Homo sapiens (Human))
University Of Minnesota Twin Cities
Curated by ChEMBL
LigandPNGBDBM50503048(CHEMBL4457754)
Affinity DataKi: <1.00E+4nM. Assay description: Displacement of [3H]-Prazosin from human recombinant adrenergic alpha1A receptor expressed in cells after 90 mins by microbeta scintillation counting...
Ligand InfoPC cidPC sid
In DepthDetails ArticlePubMed
TargetD(1A) dopamine receptor(Homo sapiens (Human))
University Of Minnesota Twin Cities
Curated by ChEMBL
LigandPNGBDBM50503048(CHEMBL4457754)
Affinity DataKi: <1.00E+4nM. Assay description: Displacement of [3H]-SCH23390 from human recombinant dopamine D1 receptor expressed in HEKT cells after 90 mins by microbeta scintillation counting m...
Ligand InfoPC cidPC sid
In DepthDetails ArticlePubMed
TargetD(2) dopamine receptor(Homo sapiens (Human))
University Of Minnesota Twin Cities
Curated by ChEMBL
LigandPNGBDBM50503048(CHEMBL4457754)
Affinity DataKi: <1.00E+4nM. Assay description: Displacement of [3H]-N-methylspiperone from human recombinant dopamine D2 receptor expressed in stable fibroblast cells after 90 mins by microbeta sc...
Ligand InfoPC cidPC sid
In DepthDetails ArticlePubMed
TargetD(1B) dopamine receptor(Homo sapiens (Human))
University Of Minnesota Twin Cities
Curated by ChEMBL
LigandPNGBDBM50503048(CHEMBL4457754)
Affinity DataKi: <1.00E+4nM. Assay description: Displacement of [3H]-SCH23390 from human recombinant dopamine D5 receptor expressed in HEKT cells after 90 mins by microbeta scintillation counting m...
Ligand InfoPC cidPC sid
In DepthDetails ArticlePubMed
Target5-hydroxytryptamine receptor 1A(Homo sapiens (Human))
University Of Minnesota Twin Cities
Curated by ChEMBL
LigandPNGBDBM50503048(CHEMBL4457754)
Affinity DataKi: >1.00E+4nM. Assay description: Displacement of [3H]-Way100635 from human recombinant 5-HT1A expressed in stable CHO cells after 90 mins by microbeta scintillation counting method
Ligand InfoPC cidPC sid
In DepthDetails ArticlePubMed
TargetBeta-2 adrenergic receptor(Homo sapiens (Human))
University Of Minnesota Twin Cities
Curated by ChEMBL
LigandPNGBDBM50503048(CHEMBL4457754)
Affinity DataKi: <1.00E+4nM. Assay description: Displacement of [3H]-CGP12177 from human recombinant adrenergic Beta2 receptor expressed in Flp-In HEK cells after 90 mins by microbeta scintillation...
Ligand InfoPC cidPC sid
In DepthDetails ArticlePubMed
Target5-hydroxytryptamine receptor 1A(Homo sapiens (Human))
University Of Minnesota Twin Cities
Curated by ChEMBL
LigandPNGBDBM50503048(CHEMBL4457754)
Affinity DataKi: <1.00E+4nM. Assay description: Displacement of [3H]-Way100635 from human recombinant 5-HT1A expressed in stable CHO cells after 90 mins by microbeta scintillation counting method
Ligand InfoPC cidPC sid
In DepthDetails ArticlePubMed