BDBM50505279 CHEMBL4436207
SMILES [H][C@@]12CCO[C@]1([H])OC[C@@H]2OC(=O)N[C@@H](Cc1ccccc1)[C@H](O)CN(CC(C)C)S(=O)(=O)c1ccc(cc1)B(O)O
InChI Key InChIKey=CGVKYOROKILIOK-HEXNFIEUSA-N
Data  1 KI
  Tab Delimited (TSV)   2D SDfile   Computed 3D by Vconf -m prep SDfile
Find this compound or compounds like it in BindingDB:
Activity Spreadsheet -- Enzyme Inhibition Constant Data from BindingDB
Found 2 hits for monomerid = 50505279
TargetProtease(Human immunodeficiency virus 1 (HIV-1))
Shandong University
Curated by ChEMBL
LigandPNGBDBM50505279(CHEMBL4436207)
Affinity DataKi:  0.00100nM. Assay description: Inhibition of HIV1 protease using RE(Edans)SGIFLETSK(Dabcyl)R as substrate by fluorescence method
Ligand InfoPC cidPC sid
In DepthDetails ArticlePubMed
TargetGag-Pol polyprotein [489-587](Human immunodeficiency virus type 1)TBA
LigandPNGBDBM50505279(CHEMBL4436207)
Affinity DataKi:  0.5nM. Assay description: In vitro inhibitory effect of histamine H3 antagonist on the electrically evoked contractile response of isolated guinea pig jejunum segments.
Ligand InfoPC cidPC sid
In DepthDetails