BDBM50506222 CHEMBL4572619
SMILES Cl.[H][C@@]12Oc3c4c(C[C@@]5([H])N(CC6CC6)CC[C@@]14[C@@]5(O)CC[C@@H]2NC(=O)c1csc2ccccc12)ccc3O
InChI Key InChIKey=OHCHVWXRKNGTQR-HBJKKLOVSA-N
Data  3 KI  1 EC50
  Tab Delimited (TSV)   2D SDfile   Computed 3D by Vconf -m prep SDfile
Find this compound or compounds like it in BindingDB:
Activity Spreadsheet -- Enzyme Inhibition Constant Data from BindingDB
Found 4 hits for monomerid = 50506222
TargetMu-type opioid receptor(MOUSE)
Virginia Commonwealth University
Curated by ChEMBL
LigandPNGBDBM50506222(CHEMBL4572619)
Affinity DataKi:  0.200nM. Assay description: Displacement of [3H]-Naloxone from mouse mu opioid receptor expressed in CHO cells incubated for 1.5 hrs by competitive radioligand binding assay
Ligand InfoPC cidPC sid
In DepthDetails ArticlePubMed
TargetKappa-type opioid receptor(Mus musculus (Mouse))
Virginia Commonwealth University
Curated by ChEMBL
LigandPNGBDBM50506222(CHEMBL4572619)
Affinity DataKi:  2.40nM. Assay description: Displacement of [3H]-Naltrindole from mouse kappa opioid receptor expressed in CHO cells incubated for 1.5 hrs by competitive radioligand binding ass...
Ligand InfoPC cidPC sid
In DepthDetails ArticlePubMed
TargetDelta-type opioid receptor(Homo sapiens (Human))
Virginia Commonwealth University
Curated by ChEMBL
LigandPNGBDBM50506222(CHEMBL4572619)
Affinity DataKi:  9.10nM. Assay description: Displacement of [3H]-norBNI from human delta opioid receptor expressed in CHO cells incubated for 1.5 hrs by competitive radioligand binding assay
Ligand InfoPC cidPC sid
In DepthDetails ArticlePubMed
TargetMu-type opioid receptor(MOUSE)
Virginia Commonwealth University
Curated by ChEMBL
LigandPNGBDBM50506222(CHEMBL4572619)
Affinity DataEC50:  1.90nM. Assay description: Agonist activity at recombinant mouse mu opioid receptor expressed in CHO cell membrane assessed as [35]-GTPgammaS binding incubated for 1.5 hrs by s...
Ligand InfoPC cidPC sid
In DepthDetails ArticlePubMed