BDBM50507311 CHEMBL4446635
SMILES Clc1cccnc1N([C@@H]1CCCNC1)C(=O)N1CCC(CC1)c1ccccc1
InChI Key InChIKey=FHCHQKOUBAJEKD-LJQANCHMSA-N
Data  1 KI
  Tab Delimited (TSV)   2D SDfile   Computed 3D by Vconf -m prep SDfile
Find this compound or compounds like it in BindingDB:
Activity Spreadsheet -- Enzyme Inhibition Constant Data from BindingDB
Found 1 hit for monomerid = 50507311
TargetPotassium voltage-gated channel subfamily H member 2(Homo sapiens (Human))
Pfizer
Curated by ChEMBL
LigandPNGBDBM50507311(CHEMBL4446635)
Affinity DataKi:  1.43E+4nM. Assay description: Binding affinity to human ERG by dofetilide fluorescence polarization binding assay
Ligand InfoPC cidPC sid
In DepthDetails ArticlePubMed